{"text_format":"1","workbook":"xlsx","n_sheets":6,"sheets":["DashBoard","1_Risk_Calc","2_Alternatives","Risk_Factors","Problem Hierarchy","Weights"],"not_rendered":{"charts":5,"images":2,"macros":1,"external_links":0,"defined_names":18,"comments":2,"pivot_tables":0},"unopened":[],"bounds":{"document_bytes":16777216,"sheet_cells":100000,"rows_first":2000,"rows_last":500,"rows_between":2000,"halvings":0,"cell_chars":16384,"cell_head_chars":4096},"cells_cut":0,"cells_raw":0,"read":"whole","date_system":"1900"}

{"sheet":"DashBoard","index":0,"n_rows":9,"n_cols":5,"rows_kept":9,"cut":false,"hidden":false,"merged":[]}
[]
[]
[]
[null,null,null,"Fugitive Dust Risk Management Tool"]
[]
[]
[null,null,null,"Step 1","Calculation of risks associated with fugitive dust sources"]
[]
[null,null,null,"Step 2","Assessment of alternatives for fugitive dust control"]

{"sheet":"1_Risk_Calc","index":1,"n_rows":214,"n_cols":35,"rows_kept":214,"cut":false,"hidden":false,"merged":[[112,16,112,27],[6,5,6,15],[7,16,7,28]]}
[null,"Fugitive Dust Risk Management Tool",null,null,null,"Source","Path","Path","Source","Receptor","Path / Receptor","Path","Source","Source","Source","Source",null,null,null,null,null,null,null,null,null,null,null,null,null,null,null,null,0,{"$f":"AC6","v":75},{"$f":"AC7","v":50}]
[null,null,null,null,null,null,null,null,null,null,null,null,null,null,null,null,null,null,null,null,null,null,null,null,null,null,null,null,null,null,null,null,100,{"$f":"AC6","v":75},{"$f":"AC7","v":50}]
[{"$f":"\"Step 1 - \"&DashBoard!E7","v":"Step 1 - Calculation of risks associated with fugitive dust sources"}]
[]
[null,null,"Cells to be populated",null,null,null,null,null,null,null,null,null,null,null,null,null,null,null,null,null,null,null,null,null,null,null,null,null,100,"Max:"]
[null,null,"Drop-down menu",null,null,null,null,null,null,null,null,null,null,null,null,null,null,null,null,null,null,null,null,null,null,null,null,null,75,"Red: >"]
[null,null,"Automatically",null,null,"Risk Factors",null,null,null,null,null,null,null,null,null,null,null,null,null,null,null,null,null,null,null,null,null,null,50,"Yellow: >"]
[null,null,null,null,null,1,2,3,4,5,6,7,8,9,10,11,"Risk Score"]
[null,"Source ID Number","Description of the structure / equipment","Location","Category","Frequency of process / activity that generates fugitive dust:","Position of the source related to sensitive areas (e.g.: communities, working areas):","Predominant wind direction is from the source to the closest sensible area?","Relative amount of visible dust generated in the process / activity:","Dust composition","Dust size range (higher mass percentage)","Is there some wind barrier (e.g.: trees, buldings, landscape) which can prevent the emissions from this source to reach the closest sensitive area?","Is there some measure applied on regular basis to prevent dust emission from this source (preventative)?","Is there some measure applied to this source to reduce dust emission once it occur (reactive)?","Is there some monitoring procedure applied to this source related to fugitive dust control?","Monitoring data / information trigger some control measure?","A","B","C","D","E","F","G","H","I","J","K","Total","Total Normal."]
[null,"S_001","WCS - Worst Case Scenario","—","Process","Continuous","Close","Yes","High ","Metals","Fine","No","No","No","No","No",{"$f":"IF(F10=0,\"\",INDEX(Risk_Factors!$O$12:$T$14,MATCH(F10,Frequency,0),MATCH($E10,Risk_Factors!$O$8:$T$8,0)))","v":0.1317536033625},{"$f":"IF(G10=0,\"\",INDEX(Risk_Factors!$O$15:$T$17,MATCH('1_Risk_Calc'!G10,Position,0),MATCH($E10,Risk_Factors!$O$8:$T$8,0)))","v":5.6068080250000006E-2},{"$f":"IF(H10=0,\"\",INDEX(Risk_Factors!$O$18:$T$19,MATCH('1_Risk_Calc'!H10,Yes_No,0),MATCH($E10,Risk_Factors!$O$8:$T$8,0)))","v":7.2206943750000002E-2},{"$f":"IF(I10=0,\"\",INDEX(Risk_Factors!$O$20:$T$22,MATCH('1_Risk_Calc'!I10,Dust_amount,0),MATCH($E10,Risk_Factors!$O$8:$T$8,0)))","v":3.8270426512500011E-2},{"$f":"IF(J10=0,\"\",INDEX(Risk_Factors!$O$23:$T$25,MATCH('1_Risk_Calc'!J10,Dust_composition,0),MATCH($E10,Risk_Factors!$O$8:$T$8,0)))","v":2.7475000000000003E-2},{"$f":"IF(K10=0,\"\",INDEX(Risk_Factors!$O$26:$T$28,MATCH('1_Risk_Calc'!K10,Dust_size,0),MATCH($E10,Risk_Factors!$O$8:$T$8,0)))","v":4.7021524831250001E-2},{"$f":"IF(L10=0,\"\",INDEX(Risk_Factors!$O$29:$T$30,MATCH('1_Risk_Calc'!L10,Risk_Factors!$E$29:$E$30,0),MATCH($E10,Risk_Factors!$O$8:$T$8,0)))","v":0.03},{"$f":"IF(M10=0,\"\",INDEX(Risk_Factors!$O$32:$T$33,MATCH('1_Risk_Calc'!M10,Risk_Factors!$E$32:$E$33,0),MATCH($E10,Risk_Factors!$O$8:$T$8,0)))","v":3.0039581250000003E-2},{"$f":"IF(N10=0,\"\",INDEX(Risk_Factors!$O$35:$T$36,MATCH('1_Risk_Calc'!N10,Risk_Factors!$E$35:$E$36,0),MATCH($E10,Risk_Factors!$O$8:$T$8,0)))","v":3.0039581250000003E-2},{"$f":"IF(O10=0,\"\",INDEX(Risk_Factors!$O$38:$T$39,MATCH('1_Risk_Calc'!O10,Risk_Factors!$E$38:$E$39,0),MATCH($E10,Risk_Factors!$O$8:$T$8,0)))","v":3.0039581250000003E-2},{"$f":"IF(P10=0,\"\",INDEX(Risk_Factors!$O$41:$T$42,MATCH('1_Risk_Calc'!P10,Risk_Factors!$E$41:$E$42,0),MATCH($E10,Risk_Factors!$O$8:$T$8,0)))","v":3.0039581250000003E-2},{"$f":"SUM(Q10:AA10)","v":0.52295390370625006},{"$f":"(AB10/MAX($AB$10:$AB$109))*$AC$5","v":100},null,null,null,{"$f":"B10","v":"S_001"},{"$f":"AC10","v":100}]
[null,"S_002",null,null,null,null,null,null,null,null,null,null,null,null,null,null,{"$f":"IF(F11=0,\"\",INDEX(Risk_Factors!$O$12:$T$14,MATCH(F11,Frequency,0),MATCH($E11,Risk_Factors!$O$8:$T$8,0)))","v":""},{"$f":"IF(G11=0,\"\",INDEX(Risk_Factors!$O$15:$T$17,MATCH('1_Risk_Calc'!G11,Position,0),MATCH($E11,Risk_Factors!$O$8:$T$8,0)))","v":""},{"$f":"IF(H11=0,\"\",INDEX(Risk_Factors!$O$18:$T$19,MATCH('1_Risk_Calc'!H11,Yes_No,0),MATCH($E11,Risk_Factors!$O$8:$T$8,0)))","v":""},{"$f":"IF(I11=0,\"\",INDEX(Risk_Factors!$O$20:$T$22,MATCH('1_Risk_Calc'!I11,Dust_amount,0),MATCH($E11,Risk_Factors!$O$8:$T$8,0)))","v":""},{"$f":"IF(J11=0,\"\",INDEX(Risk_Factors!$O$23:$T$25,MATCH('1_Risk_Calc'!J11,Dust_composition,0),MATCH($E11,Risk_Factors!$O$8:$T$8,0)))","v":""},{"$f":"IF(K11=0,\"\",INDEX(Risk_Factors!$O$26:$T$28,MATCH('1_Risk_Calc'!K11,Dust_size,0),MATCH($E11,Risk_Factors!$O$8:$T$8,0)))","v":""},{"$f":"IF(L11=0,\"\",INDEX(Risk_Factors!$O$29:$T$30,MATCH('1_Risk_Calc'!L11,Risk_Factors!$E$29:$E$30,0),MATCH($E11,Risk_Factors!$O$8:$T$8,0)))","v":""},{"$f":"IF(M11=0,\"\",INDEX(Risk_Factors!$O$32:$T$33,MATCH('1_Risk_Calc'!M11,Risk_Factors!$E$32:$E$33,0),MATCH($E11,Risk_Factors!$O$8:$T$8,0)))","v":""},{"$f":"IF(N11=0,\"\",INDEX(Risk_Factors!$O$35:$T$36,MATCH('1_Risk_Calc'!N11,Risk_Factors!$E$35:$E$36,0),MATCH($E11,Risk_Factors!$O$8:$T$8,0)))","v":""},{"$f":"IF(O11=0,\"\",INDEX(Risk_Factors!$O$38:$T$39,MATCH('1_Risk_Calc'!O11,Risk_Factors!$E$38:$E$39,0),MATCH($E11,Risk_Factors!$O$8:$T$8,0)))","v":""},{"$f":"IF(P11=0,\"\",INDEX(Risk_Factors!$O$41:$T$42,MATCH('1_Risk_Calc'!P11,Risk_Factors!$E$41:$E$42,0),MATCH($E11,Risk_Factors!$O$8:$T$8,0)))","v":""},{"$f":"SUM(Q11:AA11)","v":0},0,null,null,null,{"$f":"B11","v":"S_002"},{"$f":"AC11","v":0}]
[null,"S_003",null,null,null,null,null,null,null,null,null,null,null,null,null,null,{"$f":"IF(F12=0,\"\",INDEX(Risk_Factors!$O$12:$T$14,MATCH(F12,Frequency,0),MATCH($E12,Risk_Factors!$O$8:$T$8,0)))","v":""},{"$f":"IF(G12=0,\"\",INDEX(Risk_Factors!$O$15:$T$17,MATCH('1_Risk_Calc'!G12,Position,0),MATCH($E12,Risk_Factors!$O$8:$T$8,0)))","v":""},{"$f":"IF(H12=0,\"\",INDEX(Risk_Factors!$O$18:$T$19,MATCH('1_Risk_Calc'!H12,Yes_No,0),MATCH($E12,Risk_Factors!$O$8:$T$8,0)))","v":""},{"$f":"IF(I12=0,\"\",INDEX(Risk_Factors!$O$20:$T$22,MATCH('1_Risk_Calc'!I12,Dust_amount,0),MATCH($E12,Risk_Factors!$O$8:$T$8,0)))","v":""},{"$f":"IF(J12=0,\"\",INDEX(Risk_Factors!$O$23:$T$25,MATCH('1_Risk_Calc'!J12,Dust_composition,0),MATCH($E12,Risk_Factors!$O$8:$T$8,0)))","v":""},{"$f":"IF(K12=0,\"\",INDEX(Risk_Factors!$O$26:$T$28,MATCH('1_Risk_Calc'!K12,Dust_size,0),MATCH($E12,Risk_Factors!$O$8:$T$8,0)))","v":""},{"$f":"IF(L12=0,\"\",INDEX(Risk_Factors!$O$29:$T$30,MATCH('1_Risk_Calc'!L12,Risk_Factors!$E$29:$E$30,0),MATCH($E12,Risk_Factors!$O$8:$T$8,0)))","v":""},{"$f":"IF(M12=0,\"\",INDEX(Risk_Factors!$O$32:$T$33,MATCH('1_Risk_Calc'!M12,Risk_Factors!$E$32:$E$33,0),MATCH($E12,Risk_Factors!$O$8:$T$8,0)))","v":""},{"$f":"IF(N12=0,\"\",INDEX(Risk_Factors!$O$35:$T$36,MATCH('1_Risk_Calc'!N12,Risk_Factors!$E$35:$E$36,0),MATCH($E12,Risk_Factors!$O$8:$T$8,0)))","v":""},{"$f":"IF(O12=0,\"\",INDEX(Risk_Factors!$O$38:$T$39,MATCH('1_Risk_Calc'!O12,Risk_Factors!$E$38:$E$39,0),MATCH($E12,Risk_Factors!$O$8:$T$8,0)))","v":""},{"$f":"IF(P12=0,\"\",INDEX(Risk_Factors!$O$41:$T$42,MATCH('1_Risk_Calc'!P12,Risk_Factors!$E$41:$E$42,0),MATCH($E12,Risk_Factors!$O$8:$T$8,0)))","v":""},0,0,null,null,null,"S_003",0]
[null,"S_004",null,null,null,null,null,null,null,null,null,null,null,null,null,null,{"$f":"IF(F13=0,\"\",INDEX(Risk_Factors!$O$12:$T$14,MATCH(F13,Frequency,0),MATCH($E13,Risk_Factors!$O$8:$T$8,0)))","v":""},{"$f":"IF(G13=0,\"\",INDEX(Risk_Factors!$O$15:$T$17,MATCH('1_Risk_Calc'!G13,Position,0),MATCH($E13,Risk_Factors!$O$8:$T$8,0)))","v":""},{"$f":"IF(H13=0,\"\",INDEX(Risk_Factors!$O$18:$T$19,MATCH('1_Risk_Calc'!H13,Yes_No,0),MATCH($E13,Risk_Factors!$O$8:$T$8,0)))","v":""},{"$f":"IF(I13=0,\"\",INDEX(Risk_Factors!$O$20:$T$22,MATCH('1_Risk_Calc'!I13,Dust_amount,0),MATCH($E13,Risk_Factors!$O$8:$T$8,0)))","v":""},{"$f":"IF(J13=0,\"\",INDEX(Risk_Factors!$O$23:$T$25,MATCH('1_Risk_Calc'!J13,Dust_composition,0),MATCH($E13,Risk_Factors!$O$8:$T$8,0)))","v":""},{"$f":"IF(K13=0,\"\",INDEX(Risk_Factors!$O$26:$T$28,MATCH('1_Risk_Calc'!K13,Dust_size,0),MATCH($E13,Risk_Factors!$O$8:$T$8,0)))","v":""},{"$f":"IF(L13=0,\"\",INDEX(Risk_Factors!$O$29:$T$30,MATCH('1_Risk_Calc'!L13,Risk_Factors!$E$29:$E$30,0),MATCH($E13,Risk_Factors!$O$8:$T$8,0)))","v":""},{"$f":"IF(M13=0,\"\",INDEX(Risk_Factors!$O$32:$T$33,MATCH('1_Risk_Calc'!M13,Risk_Factors!$E$32:$E$33,0),MATCH($E13,Risk_Factors!$O$8:$T$8,0)))","v":""},{"$f":"IF(N13=0,\"\",INDEX(Risk_Factors!$O$35:$T$36,MATCH('1_Risk_Calc'!N13,Risk_Factors!$E$35:$E$36,0),MATCH($E13,Risk_Factors!$O$8:$T$8,0)))","v":""},{"$f":"IF(O13=0,\"\",INDEX(Risk_Factors!$O$38:$T$39,MATCH('1_Risk_Calc'!O13,Risk_Factors!$E$38:$E$39,0),MATCH($E13,Risk_Factors!$O$8:$T$8,0)))","v":""},{"$f":"IF(P13=0,\"\",INDEX(Risk_Factors!$O$41:$T$42,MATCH('1_Risk_Calc'!P13,Risk_Factors!$E$41:$E$42,0),MATCH($E13,Risk_Factors!$O$8:$T$8,0)))","v":""},0,0,null,null,null,"S_004",0]
[null,"S_005",null,null,null,null,null,null,null,null,null,null,null,null,null,null,{"$f":"IF(F14=0,\"\",INDEX(Risk_Factors!$O$12:$T$14,MATCH(F14,Frequency,0),MATCH($E14,Risk_Factors!$O$8:$T$8,0)))","v":""},{"$f":"IF(G14=0,\"\",INDEX(Risk_Factors!$O$15:$T$17,MATCH('1_Risk_Calc'!G14,Position,0),MATCH($E14,Risk_Factors!$O$8:$T$8,0)))","v":""},{"$f":"IF(H14=0,\"\",INDEX(Risk_Factors!$O$18:$T$19,MATCH('1_Risk_Calc'!H14,Yes_No,0),MATCH($E14,Risk_Factors!$O$8:$T$8,0)))","v":""},{"$f":"IF(I14=0,\"\",INDEX(Risk_Factors!$O$20:$T$22,MATCH('1_Risk_Calc'!I14,Dust_amount,0),MATCH($E14,Risk_Factors!$O$8:$T$8,0)))","v":""},{"$f":"IF(J14=0,\"\",INDEX(Risk_Factors!$O$23:$T$25,MATCH('1_Risk_Calc'!J14,Dust_composition,0),MATCH($E14,Risk_Factors!$O$8:$T$8,0)))","v":""},{"$f":"IF(K14=0,\"\",INDEX(Risk_Factors!$O$26:$T$28,MATCH('1_Risk_Calc'!K14,Dust_size,0),MATCH($E14,Risk_Factors!$O$8:$T$8,0)))","v":""},{"$f":"IF(L14=0,\"\",INDEX(Risk_Factors!$O$29:$T$30,MATCH('1_Risk_Calc'!L14,Risk_Factors!$E$29:$E$30,0),MATCH($E14,Risk_Factors!$O$8:$T$8,0)))","v":""},{"$f":"IF(M14=0,\"\",INDEX(Risk_Factors!$O$32:$T$33,MATCH('1_Risk_Calc'!M14,Risk_Factors!$E$32:$E$33,0),MATCH($E14,Risk_Factors!$O$8:$T$8,0)))","v":""},{"$f":"IF(N14=0,\"\",INDEX(Risk_Factors!$O$35:$T$36,MATCH('1_Risk_Calc'!N14,Risk_Factors!$E$35:$E$36,0),MATCH($E14,Risk_Factors!$O$8:$T$8,0)))","v":""},{"$f":"IF(O14=0,\"\",INDEX(Risk_Factors!$O$38:$T$39,MATCH('1_Risk_Calc'!O14,Risk_Factors!$E$38:$E$39,0),MATCH($E14,Risk_Factors!$O$8:$T$8,0)))","v":""},{"$f":"IF(P14=0,\"\",INDEX(Risk_Factors!$O$41:$T$42,MATCH('1_Risk_Calc'!P14,Risk_Factors!$E$41:$E$42,0),MATCH($E14,Risk_Factors!$O$8:$T$8,0)))","v":""},0,0,null,null,null,"S_005",0]
[null,"S_006",null,null,null,null,null,null,null,null,null,null,null,null,null,null,{"$f":"IF(F15=0,\"\",INDEX(Risk_Factors!$O$12:$T$14,MATCH(F15,Frequency,0),MATCH($E15,Risk_Factors!$O$8:$T$8,0)))","v":""},{"$f":"IF(G15=0,\"\",INDEX(Risk_Factors!$O$15:$T$17,MATCH('1_Risk_Calc'!G15,Position,0),MATCH($E15,Risk_Factors!$O$8:$T$8,0)))","v":""},{"$f":"IF(H15=0,\"\",INDEX(Risk_Factors!$O$18:$T$19,MATCH('1_Risk_Calc'!H15,Yes_No,0),MATCH($E15,Risk_Factors!$O$8:$T$8,0)))","v":""},{"$f":"IF(I15=0,\"\",INDEX(Risk_Factors!$O$20:$T$22,MATCH('1_Risk_Calc'!I15,Dust_amount,0),MATCH($E15,Risk_Factors!$O$8:$T$8,0)))","v":""},{"$f":"IF(J15=0,\"\",INDEX(Risk_Factors!$O$23:$T$25,MATCH('1_Risk_Calc'!J15,Dust_composition,0),MATCH($E15,Risk_Factors!$O$8:$T$8,0)))","v":""},{"$f":"IF(K15=0,\"\",INDEX(Risk_Factors!$O$26:$T$28,MATCH('1_Risk_Calc'!K15,Dust_size,0),MATCH($E15,Risk_Factors!$O$8:$T$8,0)))","v":""},{"$f":"IF(L15=0,\"\",INDEX(Risk_Factors!$O$29:$T$30,MATCH('1_Risk_Calc'!L15,Risk_Factors!$E$29:$E$30,0),MATCH($E15,Risk_Factors!$O$8:$T$8,0)))","v":""},{"$f":"IF(M15=0,\"\",INDEX(Risk_Factors!$O$32:$T$33,MATCH('1_Risk_Calc'!M15,Risk_Factors!$E$32:$E$33,0),MATCH($E15,Risk_Factors!$O$8:$T$8,0)))","v":""},{"$f":"IF(N15=0,\"\",INDEX(Risk_Factors!$O$35:$T$36,MATCH('1_Risk_Calc'!N15,Risk_Factors!$E$35:$E$36,0),MATCH($E15,Risk_Factors!$O$8:$T$8,0)))","v":""},{"$f":"IF(O15=0,\"\",INDEX(Risk_Factors!$O$38:$T$39,MATCH('1_Risk_Calc'!O15,Risk_Factors!$E$38:$E$39,0),MATCH($E15,Risk_Factors!$O$8:$T$8,0)))","v":""},{"$f":"IF(P15=0,\"\",INDEX(Risk_Factors!$O$41:$T$42,MATCH('1_Risk_Calc'!P15,Risk_Factors!$E$41:$E$42,0),MATCH($E15,Risk_Factors!$O$8:$T$8,0)))","v":""},0,0,null,null,null,"S_006",0]
[null,"S_007",null,null,null,null,null,null,null,null,null,null,null,null,null,null,{"$f":"IF(F16=0,\"\",INDEX(Risk_Factors!$O$12:$T$14,MATCH(F16,Frequency,0),MATCH($E16,Risk_Factors!$O$8:$T$8,0)))","v":""},{"$f":"IF(G16=0,\"\",INDEX(Risk_Factors!$O$15:$T$17,MATCH('1_Risk_Calc'!G16,Position,0),MATCH($E16,Risk_Factors!$O$8:$T$8,0)))","v":""},{"$f":"IF(H16=0,\"\",INDEX(Risk_Factors!$O$18:$T$19,MATCH('1_Risk_Calc'!H16,Yes_No,0),MATCH($E16,Risk_Factors!$O$8:$T$8,0)))","v":""},{"$f":"IF(I16=0,\"\",INDEX(Risk_Factors!$O$20:$T$22,MATCH('1_Risk_Calc'!I16,Dust_amount,0),MATCH($E16,Risk_Factors!$O$8:$T$8,0)))","v":""},{"$f":"IF(J16=0,\"\",INDEX(Risk_Factors!$O$23:$T$25,MATCH('1_Risk_Calc'!J16,Dust_composition,0),MATCH($E16,Risk_Factors!$O$8:$T$8,0)))","v":""},{"$f":"IF(K16=0,\"\",INDEX(Risk_Factors!$O$26:$T$28,MATCH('1_Risk_Calc'!K16,Dust_size,0),MATCH($E16,Risk_Factors!$O$8:$T$8,0)))","v":""},{"$f":"IF(L16=0,\"\",INDEX(Risk_Factors!$O$29:$T$30,MATCH('1_Risk_Calc'!L16,Risk_Factors!$E$29:$E$30,0),MATCH($E16,Risk_Factors!$O$8:$T$8,0)))","v":""},{"$f":"IF(M16=0,\"\",INDEX(Risk_Factors!$O$32:$T$33,MATCH('1_Risk_Calc'!M16,Risk_Factors!$E$32:$E$33,0),MATCH($E16,Risk_Factors!$O$8:$T$8,0)))","v":""},{"$f":"IF(N16=0,\"\",INDEX(Risk_Factors!$O$35:$T$36,MATCH('1_Risk_Calc'!N16,Risk_Factors!$E$35:$E$36,0),MATCH($E16,Risk_Factors!$O$8:$T$8,0)))","v":""},{"$f":"IF(O16=0,\"\",INDEX(Risk_Factors!$O$38:$T$39,MATCH('1_Risk_Calc'!O16,Risk_Factors!$E$38:$E$39,0),MATCH($E16,Risk_Factors!$O$8:$T$8,0)))","v":""},{"$f":"IF(P16=0,\"\",INDEX(Risk_Factors!$O$41:$T$42,MATCH('1_Risk_Calc'!P16,Risk_Factors!$E$41:$E$42,0),MATCH($E16,Risk_Factors!$O$8:$T$8,0)))","v":""},0,0,null,null,null,"S_007",0]
[null,"S_008",null,null,null,null,null,null,null,null,null,null,null,null,null,null,{"$f":"IF(F17=0,\"\",INDEX(Risk_Factors!$O$12:$T$14,MATCH(F17,Frequency,0),MATCH($E17,Risk_Factors!$O$8:$T$8,0)))","v":""},{"$f":"IF(G17=0,\"\",INDEX(Risk_Factors!$O$15:$T$17,MATCH('1_Risk_Calc'!G17,Position,0),MATCH($E17,Risk_Factors!$O$8:$T$8,0)))","v":""},{"$f":"IF(H17=0,\"\",INDEX(Risk_Factors!$O$18:$T$19,MATCH('1_Risk_Calc'!H17,Yes_No,0),MATCH($E17,Risk_Factors!$O$8:$T$8,0)))","v":""},{"$f":"IF(I17=0,\"\",INDEX(Risk_Factors!$O$20:$T$22,MATCH('1_Risk_Calc'!I17,Dust_amount,0),MATCH($E17,Risk_Factors!$O$8:$T$8,0)))","v":""},{"$f":"IF(J17=0,\"\",INDEX(Risk_Factors!$O$23:$T$25,MATCH('1_Risk_Calc'!J17,Dust_composition,0),MATCH($E17,Risk_Factors!$O$8:$T$8,0)))","v":""},{"$f":"IF(K17=0,\"\",INDEX(Risk_Factors!$O$26:$T$28,MATCH('1_Risk_Calc'!K17,Dust_size,0),MATCH($E17,Risk_Factors!$O$8:$T$8,0)))","v":""},{"$f":"IF(L17=0,\"\",INDEX(Risk_Factors!$O$29:$T$30,MATCH('1_Risk_Calc'!L17,Risk_Factors!$E$29:$E$30,0),MATCH($E17,Risk_Factors!$O$8:$T$8,0)))","v":""},{"$f":"IF(M17=0,\"\",INDEX(Risk_Factors!$O$32:$T$33,MATCH('1_Risk_Calc'!M17,Risk_Factors!$E$32:$E$33,0),MATCH($E17,Risk_Factors!$O$8:$T$8,0)))","v":""},{"$f":"IF(N17=0,\"\",INDEX(Risk_Factors!$O$35:$T$36,MATCH('1_Risk_Calc'!N17,Risk_Factors!$E$35:$E$36,0),MATCH($E17,Risk_Factors!$O$8:$T$8,0)))","v":""},{"$f":"IF(O17=0,\"\",INDEX(Risk_Factors!$O$38:$T$39,MATCH('1_Risk_Calc'!O17,Risk_Factors!$E$38:$E$39,0),MATCH($E17,Risk_Factors!$O$8:$T$8,0)))","v":""},{"$f":"IF(P17=0,\"\",INDEX(Risk_Factors!$O$41:$T$42,MATCH('1_Risk_Calc'!P17,Risk_Factors!$E$41:$E$42,0),MATCH($E17,Risk_Factors!$O$8:$T$8,0)))","v":""},0,0,null,null,null,"S_008",0]
[null,"S_009",null,null,null,null,null,null,null,null,null,null,null,null,null,null,{"$f":"IF(F18=0,\"\",INDEX(Risk_Factors!$O$12:$T$14,MATCH(F18,Frequency,0),MATCH($E18,Risk_Factors!$O$8:$T$8,0)))","v":""},{"$f":"IF(G18=0,\"\",INDEX(Risk_Factors!$O$15:$T$17,MATCH('1_Risk_Calc'!G18,Position,0),MATCH($E18,Risk_Factors!$O$8:$T$8,0)))","v":""},{"$f":"IF(H18=0,\"\",INDEX(Risk_Factors!$O$18:$T$19,MATCH('1_Risk_Calc'!H18,Yes_No,0),MATCH($E18,Risk_Factors!$O$8:$T$8,0)))","v":""},{"$f":"IF(I18=0,\"\",INDEX(Risk_Factors!$O$20:$T$22,MATCH('1_Risk_Calc'!I18,Dust_amount,0),MATCH($E18,Risk_Factors!$O$8:$T$8,0)))","v":""},{"$f":"IF(J18=0,\"\",INDEX(Risk_Factors!$O$23:$T$25,MATCH('1_Risk_Calc'!J18,Dust_composition,0),MATCH($E18,Risk_Factors!$O$8:$T$8,0)))","v":""},{"$f":"IF(K18=0,\"\",INDEX(Risk_Factors!$O$26:$T$28,MATCH('1_Risk_Calc'!K18,Dust_size,0),MATCH($E18,Risk_Factors!$O$8:$T$8,0)))","v":""},{"$f":"IF(L18=0,\"\",INDEX(Risk_Factors!$O$29:$T$30,MATCH('1_Risk_Calc'!L18,Risk_Factors!$E$29:$E$30,0),MATCH($E18,Risk_Factors!$O$8:$T$8,0)))","v":""},{"$f":"IF(M18=0,\"\",INDEX(Risk_Factors!$O$32:$T$33,MATCH('1_Risk_Calc'!M18,Risk_Factors!$E$32:$E$33,0),MATCH($E18,Risk_Factors!$O$8:$T$8,0)))","v":""},{"$f":"IF(N18=0,\"\",INDEX(Risk_Factors!$O$35:$T$36,MATCH('1_Risk_Calc'!N18,Risk_Factors!$E$35:$E$36,0),MATCH($E18,Risk_Factors!$O$8:$T$8,0)))","v":""},{"$f":"IF(O18=0,\"\",INDEX(Risk_Factors!$O$38:$T$39,MATCH('1_Risk_Calc'!O18,Risk_Factors!$E$38:$E$39,0),MATCH($E18,Risk_Factors!$O$8:$T$8,0)))","v":""},{"$f":"IF(P18=0,\"\",INDEX(Risk_Factors!$O$41:$T$42,MATCH('1_Risk_Calc'!P18,Risk_Factors!$E$41:$E$42,0),MATCH($E18,Risk_Factors!$O$8:$T$8,0)))","v":""},0,0,null,null,null,"S_009",0]
[null,"S_010",null,null,null,null,null,null,null,null,null,null,null,null,null,null,{"$f":"IF(F19=0,\"\",INDEX(Risk_Factors!$O$12:$T$14,MATCH(F19,Frequency,0),MATCH($E19,Risk_Factors!$O$8:$T$8,0)))","v":""},{"$f":"IF(G19=0,\"\",INDEX(Risk_Factors!$O$15:$T$17,MATCH('1_Risk_Calc'!G19,Position,0),MATCH($E19,Risk_Factors!$O$8:$T$8,0)))","v":""},{"$f":"IF(H19=0,\"\",INDEX(Risk_Factors!$O$18:$T$19,MATCH('1_Risk_Calc'!H19,Yes_No,0),MATCH($E19,Risk_Factors!$O$8:$T$8,0)))","v":""},{"$f":"IF(I19=0,\"\",INDEX(Risk_Factors!$O$20:$T$22,MATCH('1_Risk_Calc'!I19,Dust_amount,0),MATCH($E19,Risk_Factors!$O$8:$T$8,0)))","v":""},{"$f":"IF(J19=0,\"\",INDEX(Risk_Factors!$O$23:$T$25,MATCH('1_Risk_Calc'!J19,Dust_composition,0),MATCH($E19,Risk_Factors!$O$8:$T$8,0)))","v":""},{"$f":"IF(K19=0,\"\",INDEX(Risk_Factors!$O$26:$T$28,MATCH('1_Risk_Calc'!K19,Dust_size,0),MATCH($E19,Risk_Factors!$O$8:$T$8,0)))","v":""},{"$f":"IF(L19=0,\"\",INDEX(Risk_Factors!$O$29:$T$30,MATCH('1_Risk_Calc'!L19,Risk_Factors!$E$29:$E$30,0),MATCH($E19,Risk_Factors!$O$8:$T$8,0)))","v":""},{"$f":"IF(M19=0,\"\",INDEX(Risk_Factors!$O$32:$T$33,MATCH('1_Risk_Calc'!M19,Risk_Factors!$E$32:$E$33,0),MATCH($E19,Risk_Factors!$O$8:$T$8,0)))","v":""},{"$f":"IF(N19=0,\"\",INDEX(Risk_Factors!$O$35:$T$36,MATCH('1_Risk_Calc'!N19,Risk_Factors!$E$35:$E$36,0),MATCH($E19,Risk_Factors!$O$8:$T$8,0)))","v":""},{"$f":"IF(O19=0,\"\",INDEX(Risk_Factors!$O$38:$T$39,MATCH('1_Risk_Calc'!O19,Risk_Factors!$E$38:$E$39,0),MATCH($E19,Risk_Factors!$O$8:$T$8,0)))","v":""},{"$f":"IF(P19=0,\"\",INDEX(Risk_Factors!$O$41:$T$42,MATCH('1_Risk_Calc'!P19,Risk_Factors!$E$41:$E$42,0),MATCH($E19,Risk_Factors!$O$8:$T$8,0)))","v":""},0,0,null,null,null,"S_010",0]
[null,"S_011",null,null,null,null,null,null,null,null,null,null,null,null,null,null,{"$f":"IF(F20=0,\"\",INDEX(Risk_Factors!$O$12:$T$14,MATCH(F20,Frequency,0),MATCH($E20,Risk_Factors!$O$8:$T$8,0)))","v":""},{"$f":"IF(G20=0,\"\",INDEX(Risk_Factors!$O$15:$T$17,MATCH('1_Risk_Calc'!G20,Position,0),MATCH($E20,Risk_Factors!$O$8:$T$8,0)))","v":""},{"$f":"IF(H20=0,\"\",INDEX(Risk_Factors!$O$18:$T$19,MATCH('1_Risk_Calc'!H20,Yes_No,0),MATCH($E20,Risk_Factors!$O$8:$T$8,0)))","v":""},{"$f":"IF(I20=0,\"\",INDEX(Risk_Factors!$O$20:$T$22,MATCH('1_Risk_Calc'!I20,Dust_amount,0),MATCH($E20,Risk_Factors!$O$8:$T$8,0)))","v":""},{"$f":"IF(J20=0,\"\",INDEX(Risk_Factors!$O$23:$T$25,MATCH('1_Risk_Calc'!J20,Dust_composition,0),MATCH($E20,Risk_Factors!$O$8:$T$8,0)))","v":""},{"$f":"IF(K20=0,\"\",INDEX(Risk_Factors!$O$26:$T$28,MATCH('1_Risk_Calc'!K20,Dust_size,0),MATCH($E20,Risk_Factors!$O$8:$T$8,0)))","v":""},{"$f":"IF(L20=0,\"\",INDEX(Risk_Factors!$O$29:$T$30,MATCH('1_Risk_Calc'!L20,Risk_Factors!$E$29:$E$30,0),MATCH($E20,Risk_Factors!$O$8:$T$8,0)))","v":""},{"$f":"IF(M20=0,\"\",INDEX(Risk_Factors!$O$32:$T$33,MATCH('1_Risk_Calc'!M20,Risk_Factors!$E$32:$E$33,0),MATCH($E20,Risk_Factors!$O$8:$T$8,0)))","v":""},{"$f":"IF(N20=0,\"\",INDEX(Risk_Factors!$O$35:$T$36,MATCH('1_Risk_Calc'!N20,Risk_Factors!$E$35:$E$36,0),MATCH($E20,Risk_Factors!$O$8:$T$8,0)))","v":""},{"$f":"IF(O20=0,\"\",INDEX(Risk_Factors!$O$38:$T$39,MATCH('1_Risk_Calc'!O20,Risk_Factors!$E$38:$E$39,0),MATCH($E20,Risk_Factors!$O$8:$T$8,0)))","v":""},{"$f":"IF(P20=0,\"\",INDEX(Risk_Factors!$O$41:$T$42,MATCH('1_Risk_Calc'!P20,Risk_Factors!$E$41:$E$42,0),MATCH($E20,Risk_Factors!$O$8:$T$8,0)))","v":""},0,0,null,null,null,"S_011",0]
[null,"S_012",null,null,null,null,null,null,null,null,null,null,null,null,null,null,{"$f":"IF(F21=0,\"\",INDEX(Risk_Factors!$O$12:$T$14,MATCH(F21,Frequency,0),MATCH($E21,Risk_Factors!$O$8:$T$8,0)))","v":""},{"$f":"IF(G21=0,\"\",INDEX(Risk_Factors!$O$15:$T$17,MATCH('1_Risk_Calc'!G21,Position,0),MATCH($E21,Risk_Factors!$O$8:$T$8,0)))","v":""},{"$f":"IF(H21=0,\"\",INDEX(Risk_Factors!$O$18:$T$19,MATCH('1_Risk_Calc'!H21,Yes_No,0),MATCH($E21,Risk_Factors!$O$8:$T$8,0)))","v":""},{"$f":"IF(I21=0,\"\",INDEX(Risk_Factors!$O$20:$T$22,MATCH('1_Risk_Calc'!I21,Dust_amount,0),MATCH($E21,Risk_Factors!$O$8:$T$8,0)))","v":""},{"$f":"IF(J21=0,\"\",INDEX(Risk_Factors!$O$23:$T$25,MATCH('1_Risk_Calc'!J21,Dust_composition,0),MATCH($E21,Risk_Factors!$O$8:$T$8,0)))","v":""},{"$f":"IF(K21=0,\"\",INDEX(Risk_Factors!$O$26:$T$28,MATCH('1_Risk_Calc'!K21,Dust_size,0),MATCH($E21,Risk_Factors!$O$8:$T$8,0)))","v":""},{"$f":"IF(L21=0,\"\",INDEX(Risk_Factors!$O$29:$T$30,MATCH('1_Risk_Calc'!L21,Risk_Factors!$E$29:$E$30,0),MATCH($E21,Risk_Factors!$O$8:$T$8,0)))","v":""},{"$f":"IF(M21=0,\"\",INDEX(Risk_Factors!$O$32:$T$33,MATCH('1_Risk_Calc'!M21,Risk_Factors!$E$32:$E$33,0),MATCH($E21,Risk_Factors!$O$8:$T$8,0)))","v":""},{"$f":"IF(N21=0,\"\",INDEX(Risk_Factors!$O$35:$T$36,MATCH('1_Risk_Calc'!N21,Risk_Factors!$E$35:$E$36,0),MATCH($E21,Risk_Factors!$O$8:$T$8,0)))","v":""},{"$f":"IF(O21=0,\"\",INDEX(Risk_Factors!$O$38:$T$39,MATCH('1_Risk_Calc'!O21,Risk_Factors!$E$38:$E$39,0),MATCH($E21,Risk_Factors!$O$8:$T$8,0)))","v":""},{"$f":"IF(P21=0,\"\",INDEX(Risk_Factors!$O$41:$T$42,MATCH('1_Risk_Calc'!P21,Risk_Factors!$E$41:$E$42,0),MATCH($E21,Risk_Factors!$O$8:$T$8,0)))","v":""},0,0,null,null,null,"S_012",0]
[null,"S_013",null,null,null,null,null,null,null,null,null,null,null,null,null,null,{"$f":"IF(F22=0,\"\",INDEX(Risk_Factors!$O$12:$T$14,MATCH(F22,Frequency,0),MATCH($E22,Risk_Factors!$O$8:$T$8,0)))","v":""},{"$f":"IF(G22=0,\"\",INDEX(Risk_Factors!$O$15:$T$17,MATCH('1_Risk_Calc'!G22,Position,0),MATCH($E22,Risk_Factors!$O$8:$T$8,0)))","v":""},{"$f":"IF(H22=0,\"\",INDEX(Risk_Factors!$O$18:$T$19,MATCH('1_Risk_Calc'!H22,Yes_No,0),MATCH($E22,Risk_Factors!$O$8:$T$8,0)))","v":""},{"$f":"IF(I22=0,\"\",INDEX(Risk_Factors!$O$20:$T$22,MATCH('1_Risk_Calc'!I22,Dust_amount,0),MATCH($E22,Risk_Factors!$O$8:$T$8,0)))","v":""},{"$f":"IF(J22=0,\"\",INDEX(Risk_Factors!$O$23:$T$25,MATCH('1_Risk_Calc'!J22,Dust_composition,0),MATCH($E22,Risk_Factors!$O$8:$T$8,0)))","v":""},{"$f":"IF(K22=0,\"\",INDEX(Risk_Factors!$O$26:$T$28,MATCH('1_Risk_Calc'!K22,Dust_size,0),MATCH($E22,Risk_Factors!$O$8:$T$8,0)))","v":""},{"$f":"IF(L22=0,\"\",INDEX(Risk_Factors!$O$29:$T$30,MATCH('1_Risk_Calc'!L22,Risk_Factors!$E$29:$E$30,0),MATCH($E22,Risk_Factors!$O$8:$T$8,0)))","v":""},{"$f":"IF(M22=0,\"\",INDEX(Risk_Factors!$O$32:$T$33,MATCH('1_Risk_Calc'!M22,Risk_Factors!$E$32:$E$33,0),MATCH($E22,Risk_Factors!$O$8:$T$8,0)))","v":""},{"$f":"IF(N22=0,\"\",INDEX(Risk_Factors!$O$35:$T$36,MATCH('1_Risk_Calc'!N22,Risk_Factors!$E$35:$E$36,0),MATCH($E22,Risk_Factors!$O$8:$T$8,0)))","v":""},{"$f":"IF(O22=0,\"\",INDEX(Risk_Factors!$O$38:$T$39,MATCH('1_Risk_Calc'!O22,Risk_Factors!$E$38:$E$39,0),MATCH($E22,Risk_Factors!$O$8:$T$8,0)))","v":""},{"$f":"IF(P22=0,\"\",INDEX(Risk_Factors!$O$41:$T$42,MATCH('1_Risk_Calc'!P22,Risk_Factors!$E$41:$E$42,0),MATCH($E22,Risk_Factors!$O$8:$T$8,0)))","v":""},0,0,null,null,null,"S_013",0]
[null,"S_014",null,null,null,null,null,null,null,null,null,null,null,null,null,null,{"$f":"IF(F23=0,\"\",INDEX(Risk_Factors!$O$12:$T$14,MATCH(F23,Frequency,0),MATCH($E23,Risk_Factors!$O$8:$T$8,0)))","v":""},{"$f":"IF(G23=0,\"\",INDEX(Risk_Factors!$O$15:$T$17,MATCH('1_Risk_Calc'!G23,Position,0),MATCH($E23,Risk_Factors!$O$8:$T$8,0)))","v":""},{"$f":"IF(H23=0,\"\",INDEX(Risk_Factors!$O$18:$T$19,MATCH('1_Risk_Calc'!H23,Yes_No,0),MATCH($E23,Risk_Factors!$O$8:$T$8,0)))","v":""},{"$f":"IF(I23=0,\"\",INDEX(Risk_Factors!$O$20:$T$22,MATCH('1_Risk_Calc'!I23,Dust_amount,0),MATCH($E23,Risk_Factors!$O$8:$T$8,0)))","v":""},{"$f":"IF(J23=0,\"\",INDEX(Risk_Factors!$O$23:$T$25,MATCH('1_Risk_Calc'!J23,Dust_composition,0),MATCH($E23,Risk_Factors!$O$8:$T$8,0)))","v":""},{"$f":"IF(K23=0,\"\",INDEX(Risk_Factors!$O$26:$T$28,MATCH('1_Risk_Calc'!K23,Dust_size,0),MATCH($E23,Risk_Factors!$O$8:$T$8,0)))","v":""},{"$f":"IF(L23=0,\"\",INDEX(Risk_Factors!$O$29:$T$30,MATCH('1_Risk_Calc'!L23,Risk_Factors!$E$29:$E$30,0),MATCH($E23,Risk_Factors!$O$8:$T$8,0)))","v":""},{"$f":"IF(M23=0,\"\",INDEX(Risk_Factors!$O$32:$T$33,MATCH('1_Risk_Calc'!M23,Risk_Factors!$E$32:$E$33,0),MATCH($E23,Risk_Factors!$O$8:$T$8,0)))","v":""},{"$f":"IF(N23=0,\"\",INDEX(Risk_Factors!$O$35:$T$36,MATCH('1_Risk_Calc'!N23,Risk_Factors!$E$35:$E$36,0),MATCH($E23,Risk_Factors!$O$8:$T$8,0)))","v":""},{"$f":"IF(O23=0,\"\",INDEX(Risk_Factors!$O$38:$T$39,MATCH('1_Risk_Calc'!O23,Risk_Factors!$E$38:$E$39,0),MATCH($E23,Risk_Factors!$O$8:$T$8,0)))","v":""},{"$f":"IF(P23=0,\"\",INDEX(Risk_Factors!$O$41:$T$42,MATCH('1_Risk_Calc'!P23,Risk_Factors!$E$41:$E$42,0),MATCH($E23,Risk_Factors!$O$8:$T$8,0)))","v":""},0,0,null,null,null,"S_014",0]
[null,"S_015",null,null,null,null,null,null,null,null,null,null,null,null,null,null,{"$f":"IF(F24=0,\"\",INDEX(Risk_Factors!$O$12:$T$14,MATCH(F24,Frequency,0),MATCH($E24,Risk_Factors!$O$8:$T$8,0)))","v":""},{"$f":"IF(G24=0,\"\",INDEX(Risk_Factors!$O$15:$T$17,MATCH('1_Risk_Calc'!G24,Position,0),MATCH($E24,Risk_Factors!$O$8:$T$8,0)))","v":""},{"$f":"IF(H24=0,\"\",INDEX(Risk_Factors!$O$18:$T$19,MATCH('1_Risk_Calc'!H24,Yes_No,0),MATCH($E24,Risk_Factors!$O$8:$T$8,0)))","v":""},{"$f":"IF(I24=0,\"\",INDEX(Risk_Factors!$O$20:$T$22,MATCH('1_Risk_Calc'!I24,Dust_amount,0),MATCH($E24,Risk_Factors!$O$8:$T$8,0)))","v":""},{"$f":"IF(J24=0,\"\",INDEX(Risk_Factors!$O$23:$T$25,MATCH('1_Risk_Calc'!J24,Dust_composition,0),MATCH($E24,Risk_Factors!$O$8:$T$8,0)))","v":""},{"$f":"IF(K24=0,\"\",INDEX(Risk_Factors!$O$26:$T$28,MATCH('1_Risk_Calc'!K24,Dust_size,0),MATCH($E24,Risk_Factors!$O$8:$T$8,0)))","v":""},{"$f":"IF(L24=0,\"\",INDEX(Risk_Factors!$O$29:$T$30,MATCH('1_Risk_Calc'!L24,Risk_Factors!$E$29:$E$30,0),MATCH($E24,Risk_Factors!$O$8:$T$8,0)))","v":""},{"$f":"IF(M24=0,\"\",INDEX(Risk_Factors!$O$32:$T$33,MATCH('1_Risk_Calc'!M24,Risk_Factors!$E$32:$E$33,0),MATCH($E24,Risk_Factors!$O$8:$T$8,0)))","v":""},{"$f":"IF(N24=0,\"\",INDEX(Risk_Factors!$O$35:$T$36,MATCH('1_Risk_Calc'!N24,Risk_Factors!$E$35:$E$36,0),MATCH($E24,Risk_Factors!$O$8:$T$8,0)))","v":""},{"$f":"IF(O24=0,\"\",INDEX(Risk_Factors!$O$38:$T$39,MATCH('1_Risk_Calc'!O24,Risk_Factors!$E$38:$E$39,0),MATCH($E24,Risk_Factors!$O$8:$T$8,0)))","v":""},{"$f":"IF(P24=0,\"\",INDEX(Risk_Factors!$O$41:$T$42,MATCH('1_Risk_Calc'!P24,Risk_Factors!$E$41:$E$42,0),MATCH($E24,Risk_Factors!$O$8:$T$8,0)))","v":""},0,0,null,null,null,"S_015",0]
[null,"S_016",null,null,null,null,null,null,null,null,null,null,null,null,null,null,{"$f":"IF(F25=0,\"\",INDEX(Risk_Factors!$O$12:$T$14,MATCH(F25,Frequency,0),MATCH($E25,Risk_Factors!$O$8:$T$8,0)))","v":""},{"$f":"IF(G25=0,\"\",INDEX(Risk_Factors!$O$15:$T$17,MATCH('1_Risk_Calc'!G25,Position,0),MATCH($E25,Risk_Factors!$O$8:$T$8,0)))","v":""},{"$f":"IF(H25=0,\"\",INDEX(Risk_Factors!$O$18:$T$19,MATCH('1_Risk_Calc'!H25,Yes_No,0),MATCH($E25,Risk_Factors!$O$8:$T$8,0)))","v":""},{"$f":"IF(I25=0,\"\",INDEX(Risk_Factors!$O$20:$T$22,MATCH('1_Risk_Calc'!I25,Dust_amount,0),MATCH($E25,Risk_Factors!$O$8:$T$8,0)))","v":""},{"$f":"IF(J25=0,\"\",INDEX(Risk_Factors!$O$23:$T$25,MATCH('1_Risk_Calc'!J25,Dust_composition,0),MATCH($E25,Risk_Factors!$O$8:$T$8,0)))","v":""},{"$f":"IF(K25=0,\"\",INDEX(Risk_Factors!$O$26:$T$28,MATCH('1_Risk_Calc'!K25,Dust_size,0),MATCH($E25,Risk_Factors!$O$8:$T$8,0)))","v":""},{"$f":"IF(L25=0,\"\",INDEX(Risk_Factors!$O$29:$T$30,MATCH('1_Risk_Calc'!L25,Risk_Factors!$E$29:$E$30,0),MATCH($E25,Risk_Factors!$O$8:$T$8,0)))","v":""},{"$f":"IF(M25=0,\"\",INDEX(Risk_Factors!$O$32:$T$33,MATCH('1_Risk_Calc'!M25,Risk_Factors!$E$32:$E$33,0),MATCH($E25,Risk_Factors!$O$8:$T$8,0)))","v":""},{"$f":"IF(N25=0,\"\",INDEX(Risk_Factors!$O$35:$T$36,MATCH('1_Risk_Calc'!N25,Risk_Factors!$E$35:$E$36,0),MATCH($E25,Risk_Factors!$O$8:$T$8,0)))","v":""},{"$f":"IF(O25=0,\"\",INDEX(Risk_Factors!$O$38:$T$39,MATCH('1_Risk_Calc'!O25,Risk_Factors!$E$38:$E$39,0),MATCH($E25,Risk_Factors!$O$8:$T$8,0)))","v":""},{"$f":"IF(P25=0,\"\",INDEX(Risk_Factors!$O$41:$T$42,MATCH('1_Risk_Calc'!P25,Risk_Factors!$E$41:$E$42,0),MATCH($E25,Risk_Factors!$O$8:$T$8,0)))","v":""},0,0,null,null,null,"S_016",0]
[null,"S_017",null,null,null,null,null,null,null,null,null,null,null,null,null,null,{"$f":"IF(F26=0,\"\",INDEX(Risk_Factors!$O$12:$T$14,MATCH(F26,Frequency,0),MATCH($E26,Risk_Factors!$O$8:$T$8,0)))","v":""},{"$f":"IF(G26=0,\"\",INDEX(Risk_Factors!$O$15:$T$17,MATCH('1_Risk_Calc'!G26,Position,0),MATCH($E26,Risk_Factors!$O$8:$T$8,0)))","v":""},{"$f":"IF(H26=0,\"\",INDEX(Risk_Factors!$O$18:$T$19,MATCH('1_Risk_Calc'!H26,Yes_No,0),MATCH($E26,Risk_Factors!$O$8:$T$8,0)))","v":""},{"$f":"IF(I26=0,\"\",INDEX(Risk_Factors!$O$20:$T$22,MATCH('1_Risk_Calc'!I26,Dust_amount,0),MATCH($E26,Risk_Factors!$O$8:$T$8,0)))","v":""},{"$f":"IF(J26=0,\"\",INDEX(Risk_Factors!$O$23:$T$25,MATCH('1_Risk_Calc'!J26,Dust_composition,0),MATCH($E26,Risk_Factors!$O$8:$T$8,0)))","v":""},{"$f":"IF(K26=0,\"\",INDEX(Risk_Factors!$O$26:$T$28,MATCH('1_Risk_Calc'!K26,Dust_size,0),MATCH($E26,Risk_Factors!$O$8:$T$8,0)))","v":""},{"$f":"IF(L26=0,\"\",INDEX(Risk_Factors!$O$29:$T$30,MATCH('1_Risk_Calc'!L26,Risk_Factors!$E$29:$E$30,0),MATCH($E26,Risk_Factors!$O$8:$T$8,0)))","v":""},{"$f":"IF(M26=0,\"\",INDEX(Risk_Factors!$O$32:$T$33,MATCH('1_Risk_Calc'!M26,Risk_Factors!$E$32:$E$33,0),MATCH($E26,Risk_Factors!$O$8:$T$8,0)))","v":""},{"$f":"IF(N26=0,\"\",INDEX(Risk_Factors!$O$35:$T$36,MATCH('1_Risk_Calc'!N26,Risk_Factors!$E$35:$E$36,0),MATCH($E26,Risk_Factors!$O$8:$T$8,0)))","v":""},{"$f":"IF(O26=0,\"\",INDEX(Risk_Factors!$O$38:$T$39,MATCH('1_Risk_Calc'!O26,Risk_Factors!$E$38:$E$39,0),MATCH($E26,Risk_Factors!$O$8:$T$8,0)))","v":""},{"$f":"IF(P26=0,\"\",INDEX(Risk_Factors!$O$41:$T$42,MATCH('1_Risk_Calc'!P26,Risk_Factors!$E$41:$E$42,0),MATCH($E26,Risk_Factors!$O$8:$T$8,0)))","v":""},0,0,null,null,null,"S_017",0]
[null,"S_018",null,null,null,null,null,null,null,null,null,null,null,null,null,null,{"$f":"IF(F27=0,\"\",INDEX(Risk_Factors!$O$12:$T$14,MATCH(F27,Frequency,0),MATCH($E27,Risk_Factors!$O$8:$T$8,0)))","v":""},{"$f":"IF(G27=0,\"\",INDEX(Risk_Factors!$O$15:$T$17,MATCH('1_Risk_Calc'!G27,Position,0),MATCH($E27,Risk_Factors!$O$8:$T$8,0)))","v":""},{"$f":"IF(H27=0,\"\",INDEX(Risk_Factors!$O$18:$T$19,MATCH('1_Risk_Calc'!H27,Yes_No,0),MATCH($E27,Risk_Factors!$O$8:$T$8,0)))","v":""},{"$f":"IF(I27=0,\"\",INDEX(Risk_Factors!$O$20:$T$22,MATCH('1_Risk_Calc'!I27,Dust_amount,0),MATCH($E27,Risk_Factors!$O$8:$T$8,0)))","v":""},{"$f":"IF(J27=0,\"\",INDEX(Risk_Factors!$O$23:$T$25,MATCH('1_Risk_Calc'!J27,Dust_composition,0),MATCH($E27,Risk_Factors!$O$8:$T$8,0)))","v":""},{"$f":"IF(K27=0,\"\",INDEX(Risk_Factors!$O$26:$T$28,MATCH('1_Risk_Calc'!K27,Dust_size,0),MATCH($E27,Risk_Factors!$O$8:$T$8,0)))","v":""},{"$f":"IF(L27=0,\"\",INDEX(Risk_Factors!$O$29:$T$30,MATCH('1_Risk_Calc'!L27,Risk_Factors!$E$29:$E$30,0),MATCH($E27,Risk_Factors!$O$8:$T$8,0)))","v":""},{"$f":"IF(M27=0,\"\",INDEX(Risk_Factors!$O$32:$T$33,MATCH('1_Risk_Calc'!M27,Risk_Factors!$E$32:$E$33,0),MATCH($E27,Risk_Factors!$O$8:$T$8,0)))","v":""},{"$f":"IF(N27=0,\"\",INDEX(Risk_Factors!$O$35:$T$36,MATCH('1_Risk_Calc'!N27,Risk_Factors!$E$35:$E$36,0),MATCH($E27,Risk_Factors!$O$8:$T$8,0)))","v":""},{"$f":"IF(O27=0,\"\",INDEX(Risk_Factors!$O$38:$T$39,MATCH('1_Risk_Calc'!O27,Risk_Factors!$E$38:$E$39,0),MATCH($E27,Risk_Factors!$O$8:$T$8,0)))","v":""},{"$f":"IF(P27=0,\"\",INDEX(Risk_Factors!$O$41:$T$42,MATCH('1_Risk_Calc'!P27,Risk_Factors!$E$41:$E$42,0),MATCH($E27,Risk_Factors!$O$8:$T$8,0)))","v":""},0,0,null,null,null,"S_018",0]
[null,"S_019",null,null,null,null,null,null,null,null,null,null,null,null,null,null,{"$f":"IF(F28=0,\"\",INDEX(Risk_Factors!$O$12:$T$14,MATCH(F28,Frequency,0),MATCH($E28,Risk_Factors!$O$8:$T$8,0)))","v":""},{"$f":"IF(G28=0,\"\",INDEX(Risk_Factors!$O$15:$T$17,MATCH('1_Risk_Calc'!G28,Position,0),MATCH($E28,Risk_Factors!$O$8:$T$8,0)))","v":""},{"$f":"IF(H28=0,\"\",INDEX(Risk_Factors!$O$18:$T$19,MATCH('1_Risk_Calc'!H28,Yes_No,0),MATCH($E28,Risk_Factors!$O$8:$T$8,0)))","v":""},{"$f":"IF(I28=0,\"\",INDEX(Risk_Factors!$O$20:$T$22,MATCH('1_Risk_Calc'!I28,Dust_amount,0),MATCH($E28,Risk_Factors!$O$8:$T$8,0)))","v":""},{"$f":"IF(J28=0,\"\",INDEX(Risk_Factors!$O$23:$T$25,MATCH('1_Risk_Calc'!J28,Dust_composition,0),MATCH($E28,Risk_Factors!$O$8:$T$8,0)))","v":""},{"$f":"IF(K28=0,\"\",INDEX(Risk_Factors!$O$26:$T$28,MATCH('1_Risk_Calc'!K28,Dust_size,0),MATCH($E28,Risk_Factors!$O$8:$T$8,0)))","v":""},{"$f":"IF(L28=0,\"\",INDEX(Risk_Factors!$O$29:$T$30,MATCH('1_Risk_Calc'!L28,Risk_Factors!$E$29:$E$30,0),MATCH($E28,Risk_Factors!$O$8:$T$8,0)))","v":""},{"$f":"IF(M28=0,\"\",INDEX(Risk_Factors!$O$32:$T$33,MATCH('1_Risk_Calc'!M28,Risk_Factors!$E$32:$E$33,0),MATCH($E28,Risk_Factors!$O$8:$T$8,0)))","v":""},{"$f":"IF(N28=0,\"\",INDEX(Risk_Factors!$O$35:$T$36,MATCH('1_Risk_Calc'!N28,Risk_Factors!$E$35:$E$36,0),MATCH($E28,Risk_Factors!$O$8:$T$8,0)))","v":""},{"$f":"IF(O28=0,\"\",INDEX(Risk_Factors!$O$38:$T$39,MATCH('1_Risk_Calc'!O28,Risk_Factors!$E$38:$E$39,0),MATCH($E28,Risk_Factors!$O$8:$T$8,0)))","v":""},{"$f":"IF(P28=0,\"\",INDEX(Risk_Factors!$O$41:$T$42,MATCH('1_Risk_Calc'!P28,Risk_Factors!$E$41:$E$42,0),MATCH($E28,Risk_Factors!$O$8:$T$8,0)))","v":""},0,0,null,null,null,"S_019",0]
[null,"S_020",null,null,null,null,null,null,null,null,null,null,null,null,null,null,{"$f":"IF(F29=0,\"\",INDEX(Risk_Factors!$O$12:$T$14,MATCH(F29,Frequency,0),MATCH($E29,Risk_Factors!$O$8:$T$8,0)))","v":""},{"$f":"IF(G29=0,\"\",INDEX(Risk_Factors!$O$15:$T$17,MATCH('1_Risk_Calc'!G29,Position,0),MATCH($E29,Risk_Factors!$O$8:$T$8,0)))","v":""},{"$f":"IF(H29=0,\"\",INDEX(Risk_Factors!$O$18:$T$19,MATCH('1_Risk_Calc'!H29,Yes_No,0),MATCH($E29,Risk_Factors!$O$8:$T$8,0)))","v":""},{"$f":"IF(I29=0,\"\",INDEX(Risk_Factors!$O$20:$T$22,MATCH('1_Risk_Calc'!I29,Dust_amount,0),MATCH($E29,Risk_Factors!$O$8:$T$8,0)))","v":""},{"$f":"IF(J29=0,\"\",INDEX(Risk_Factors!$O$23:$T$25,MATCH('1_Risk_Calc'!J29,Dust_composition,0),MATCH($E29,Risk_Factors!$O$8:$T$8,0)))","v":""},{"$f":"IF(K29=0,\"\",INDEX(Risk_Factors!$O$26:$T$28,MATCH('1_Risk_Calc'!K29,Dust_size,0),MATCH($E29,Risk_Factors!$O$8:$T$8,0)))","v":""},{"$f":"IF(L29=0,\"\",INDEX(Risk_Factors!$O$29:$T$30,MATCH('1_Risk_Calc'!L29,Risk_Factors!$E$29:$E$30,0),MATCH($E29,Risk_Factors!$O$8:$T$8,0)))","v":""},{"$f":"IF(M29=0,\"\",INDEX(Risk_Factors!$O$32:$T$33,MATCH('1_Risk_Calc'!M29,Risk_Factors!$E$32:$E$33,0),MATCH($E29,Risk_Factors!$O$8:$T$8,0)))","v":""},{"$f":"IF(N29=0,\"\",INDEX(Risk_Factors!$O$35:$T$36,MATCH('1_Risk_Calc'!N29,Risk_Factors!$E$35:$E$36,0),MATCH($E29,Risk_Factors!$O$8:$T$8,0)))","v":""},{"$f":"IF(O29=0,\"\",INDEX(Risk_Factors!$O$38:$T$39,MATCH('1_Risk_Calc'!O29,Risk_Factors!$E$38:$E$39,0),MATCH($E29,Risk_Factors!$O$8:$T$8,0)))","v":""},{"$f":"IF(P29=0,\"\",INDEX(Risk_Factors!$O$41:$T$42,MATCH('1_Risk_Calc'!P29,Risk_Factors!$E$41:$E$42,0),MATCH($E29,Risk_Factors!$O$8:$T$8,0)))","v":""},0,0,null,null,null,"S_020",0]
[null,"S_021",null,null,null,null,null,null,null,null,null,null,null,null,null,null,{"$f":"IF(F30=0,\"\",INDEX(Risk_Factors!$O$12:$T$14,MATCH(F30,Frequency,0),MATCH($E30,Risk_Factors!$O$8:$T$8,0)))","v":""},{"$f":"IF(G30=0,\"\",INDEX(Risk_Factors!$O$15:$T$17,MATCH('1_Risk_Calc'!G30,Position,0),MATCH($E30,Risk_Factors!$O$8:$T$8,0)))","v":""},{"$f":"IF(H30=0,\"\",INDEX(Risk_Factors!$O$18:$T$19,MATCH('1_Risk_Calc'!H30,Yes_No,0),MATCH($E30,Risk_Factors!$O$8:$T$8,0)))","v":""},{"$f":"IF(I30=0,\"\",INDEX(Risk_Factors!$O$20:$T$22,MATCH('1_Risk_Calc'!I30,Dust_amount,0),MATCH($E30,Risk_Factors!$O$8:$T$8,0)))","v":""},{"$f":"IF(J30=0,\"\",INDEX(Risk_Factors!$O$23:$T$25,MATCH('1_Risk_Calc'!J30,Dust_composition,0),MATCH($E30,Risk_Factors!$O$8:$T$8,0)))","v":""},{"$f":"IF(K30=0,\"\",INDEX(Risk_Factors!$O$26:$T$28,MATCH('1_Risk_Calc'!K30,Dust_size,0),MATCH($E30,Risk_Factors!$O$8:$T$8,0)))","v":""},{"$f":"IF(L30=0,\"\",INDEX(Risk_Factors!$O$29:$T$30,MATCH('1_Risk_Calc'!L30,Risk_Factors!$E$29:$E$30,0),MATCH($E30,Risk_Factors!$O$8:$T$8,0)))","v":""},{"$f":"IF(M30=0,\"\",INDEX(Risk_Factors!$O$32:$T$33,MATCH('1_Risk_Calc'!M30,Risk_Factors!$E$32:$E$33,0),MATCH($E30,Risk_Factors!$O$8:$T$8,0)))","v":""},{"$f":"IF(N30=0,\"\",INDEX(Risk_Factors!$O$35:$T$36,MATCH('1_Risk_Calc'!N30,Risk_Factors!$E$35:$E$36,0),MATCH($E30,Risk_Factors!$O$8:$T$8,0)))","v":""},{"$f":"IF(O30=0,\"\",INDEX(Risk_Factors!$O$38:$T$39,MATCH('1_Risk_Calc'!O30,Risk_Factors!$E$38:$E$39,0),MATCH($E30,Risk_Factors!$O$8:$T$8,0)))","v":""},{"$f":"IF(P30=0,\"\",INDEX(Risk_Factors!$O$41:$T$42,MATCH('1_Risk_Calc'!P30,Risk_Factors!$E$41:$E$42,0),MATCH($E30,Risk_Factors!$O$8:$T$8,0)))","v":""},0,0,null,null,null,"S_021",0]
[null,"S_022",null,null,null,null,null,null,null,null,null,null,null,null,null,null,{"$f":"IF(F31=0,\"\",INDEX(Risk_Factors!$O$12:$T$14,MATCH(F31,Frequency,0),MATCH($E31,Risk_Factors!$O$8:$T$8,0)))","v":""},{"$f":"IF(G31=0,\"\",INDEX(Risk_Factors!$O$15:$T$17,MATCH('1_Risk_Calc'!G31,Position,0),MATCH($E31,Risk_Factors!$O$8:$T$8,0)))","v":""},{"$f":"IF(H31=0,\"\",INDEX(Risk_Factors!$O$18:$T$19,MATCH('1_Risk_Calc'!H31,Yes_No,0),MATCH($E31,Risk_Factors!$O$8:$T$8,0)))","v":""},{"$f":"IF(I31=0,\"\",INDEX(Risk_Factors!$O$20:$T$22,MATCH('1_Risk_Calc'!I31,Dust_amount,0),MATCH($E31,Risk_Factors!$O$8:$T$8,0)))","v":""},{"$f":"IF(J31=0,\"\",INDEX(Risk_Factors!$O$23:$T$25,MATCH('1_Risk_Calc'!J31,Dust_composition,0),MATCH($E31,Risk_Factors!$O$8:$T$8,0)))","v":""},{"$f":"IF(K31=0,\"\",INDEX(Risk_Factors!$O$26:$T$28,MATCH('1_Risk_Calc'!K31,Dust_size,0),MATCH($E31,Risk_Factors!$O$8:$T$8,0)))","v":""},{"$f":"IF(L31=0,\"\",INDEX(Risk_Factors!$O$29:$T$30,MATCH('1_Risk_Calc'!L31,Risk_Factors!$E$29:$E$30,0),MATCH($E31,Risk_Factors!$O$8:$T$8,0)))","v":""},{"$f":"IF(M31=0,\"\",INDEX(Risk_Factors!$O$32:$T$33,MATCH('1_Risk_Calc'!M31,Risk_Factors!$E$32:$E$33,0),MATCH($E31,Risk_Factors!$O$8:$T$8,0)))","v":""},{"$f":"IF(N31=0,\"\",INDEX(Risk_Factors!$O$35:$T$36,MATCH('1_Risk_Calc'!N31,Risk_Factors!$E$35:$E$36,0),MATCH($E31,Risk_Factors!$O$8:$T$8,0)))","v":""},{"$f":"IF(O31=0,\"\",INDEX(Risk_Factors!$O$38:$T$39,MATCH('1_Risk_Calc'!O31,Risk_Factors!$E$38:$E$39,0),MATCH($E31,Risk_Factors!$O$8:$T$8,0)))","v":""},{"$f":"IF(P31=0,\"\",INDEX(Risk_Factors!$O$41:$T$42,MATCH('1_Risk_Calc'!P31,Risk_Factors!$E$41:$E$42,0),MATCH($E31,Risk_Factors!$O$8:$T$8,0)))","v":""},0,0,null,null,null,"S_022",0]
[null,"S_023",null,null,null,null,null,null,null,null,null,null,null,null,null,null,{"$f":"IF(F32=0,\"\",INDEX(Risk_Factors!$O$12:$T$14,MATCH(F32,Frequency,0),MATCH($E32,Risk_Factors!$O$8:$T$8,0)))","v":""},{"$f":"IF(G32=0,\"\",INDEX(Risk_Factors!$O$15:$T$17,MATCH('1_Risk_Calc'!G32,Position,0),MATCH($E32,Risk_Factors!$O$8:$T$8,0)))","v":""},{"$f":"IF(H32=0,\"\",INDEX(Risk_Factors!$O$18:$T$19,MATCH('1_Risk_Calc'!H32,Yes_No,0),MATCH($E32,Risk_Factors!$O$8:$T$8,0)))","v":""},{"$f":"IF(I32=0,\"\",INDEX(Risk_Factors!$O$20:$T$22,MATCH('1_Risk_Calc'!I32,Dust_amount,0),MATCH($E32,Risk_Factors!$O$8:$T$8,0)))","v":""},{"$f":"IF(J32=0,\"\",INDEX(Risk_Factors!$O$23:$T$25,MATCH('1_Risk_Calc'!J32,Dust_composition,0),MATCH($E32,Risk_Factors!$O$8:$T$8,0)))","v":""},{"$f":"IF(K32=0,\"\",INDEX(Risk_Factors!$O$26:$T$28,MATCH('1_Risk_Calc'!K32,Dust_size,0),MATCH($E32,Risk_Factors!$O$8:$T$8,0)))","v":""},{"$f":"IF(L32=0,\"\",INDEX(Risk_Factors!$O$29:$T$30,MATCH('1_Risk_Calc'!L32,Risk_Factors!$E$29:$E$30,0),MATCH($E32,Risk_Factors!$O$8:$T$8,0)))","v":""},{"$f":"IF(M32=0,\"\",INDEX(Risk_Factors!$O$32:$T$33,MATCH('1_Risk_Calc'!M32,Risk_Factors!$E$32:$E$33,0),MATCH($E32,Risk_Factors!$O$8:$T$8,0)))","v":""},{"$f":"IF(N32=0,\"\",INDEX(Risk_Factors!$O$35:$T$36,MATCH('1_Risk_Calc'!N32,Risk_Factors!$E$35:$E$36,0),MATCH($E32,Risk_Factors!$O$8:$T$8,0)))","v":""},{"$f":"IF(O32=0,\"\",INDEX(Risk_Factors!$O$38:$T$39,MATCH('1_Risk_Calc'!O32,Risk_Factors!$E$38:$E$39,0),MATCH($E32,Risk_Factors!$O$8:$T$8,0)))","v":""},{"$f":"IF(P32=0,\"\",INDEX(Risk_Factors!$O$41:$T$42,MATCH('1_Risk_Calc'!P32,Risk_Factors!$E$41:$E$42,0),MATCH($E32,Risk_Factors!$O$8:$T$8,0)))","v":""},0,0,null,null,null,"S_023",0]
[null,"S_024",null,null,null,null,null,null,null,null,null,null,null,null,null,null,{"$f":"IF(F33=0,\"\",INDEX(Risk_Factors!$O$12:$T$14,MATCH(F33,Frequency,0),MATCH($E33,Risk_Factors!$O$8:$T$8,0)))","v":""},{"$f":"IF(G33=0,\"\",INDEX(Risk_Factors!$O$15:$T$17,MATCH('1_Risk_Calc'!G33,Position,0),MATCH($E33,Risk_Factors!$O$8:$T$8,0)))","v":""},{"$f":"IF(H33=0,\"\",INDEX(Risk_Factors!$O$18:$T$19,MATCH('1_Risk_Calc'!H33,Yes_No,0),MATCH($E33,Risk_Factors!$O$8:$T$8,0)))","v":""},{"$f":"IF(I33=0,\"\",INDEX(Risk_Factors!$O$20:$T$22,MATCH('1_Risk_Calc'!I33,Dust_amount,0),MATCH($E33,Risk_Factors!$O$8:$T$8,0)))","v":""},{"$f":"IF(J33=0,\"\",INDEX(Risk_Factors!$O$23:$T$25,MATCH('1_Risk_Calc'!J33,Dust_composition,0),MATCH($E33,Risk_Factors!$O$8:$T$8,0)))","v":""},{"$f":"IF(K33=0,\"\",INDEX(Risk_Factors!$O$26:$T$28,MATCH('1_Risk_Calc'!K33,Dust_size,0),MATCH($E33,Risk_Factors!$O$8:$T$8,0)))","v":""},{"$f":"IF(L33=0,\"\",INDEX(Risk_Factors!$O$29:$T$30,MATCH('1_Risk_Calc'!L33,Risk_Factors!$E$29:$E$30,0),MATCH($E33,Risk_Factors!$O$8:$T$8,0)))","v":""},{"$f":"IF(M33=0,\"\",INDEX(Risk_Factors!$O$32:$T$33,MATCH('1_Risk_Calc'!M33,Risk_Factors!$E$32:$E$33,0),MATCH($E33,Risk_Factors!$O$8:$T$8,0)))","v":""},{"$f":"IF(N33=0,\"\",INDEX(Risk_Factors!$O$35:$T$36,MATCH('1_Risk_Calc'!N33,Risk_Factors!$E$35:$E$36,0),MATCH($E33,Risk_Factors!$O$8:$T$8,0)))","v":""},{"$f":"IF(O33=0,\"\",INDEX(Risk_Factors!$O$38:$T$39,MATCH('1_Risk_Calc'!O33,Risk_Factors!$E$38:$E$39,0),MATCH($E33,Risk_Factors!$O$8:$T$8,0)))","v":""},{"$f":"IF(P33=0,\"\",INDEX(Risk_Factors!$O$41:$T$42,MATCH('1_Risk_Calc'!P33,Risk_Factors!$E$41:$E$42,0),MATCH($E33,Risk_Factors!$O$8:$T$8,0)))","v":""},0,0,null,null,null,"S_024",0]
[null,"S_025",null,null,null,null,null,null,null,null,null,null,null,null,null,null,{"$f":"IF(F34=0,\"\",INDEX(Risk_Factors!$O$12:$T$14,MATCH(F34,Frequency,0),MATCH($E34,Risk_Factors!$O$8:$T$8,0)))","v":""},{"$f":"IF(G34=0,\"\",INDEX(Risk_Factors!$O$15:$T$17,MATCH('1_Risk_Calc'!G34,Position,0),MATCH($E34,Risk_Factors!$O$8:$T$8,0)))","v":""},{"$f":"IF(H34=0,\"\",INDEX(Risk_Factors!$O$18:$T$19,MATCH('1_Risk_Calc'!H34,Yes_No,0),MATCH($E34,Risk_Factors!$O$8:$T$8,0)))","v":""},{"$f":"IF(I34=0,\"\",INDEX(Risk_Factors!$O$20:$T$22,MATCH('1_Risk_Calc'!I34,Dust_amount,0),MATCH($E34,Risk_Factors!$O$8:$T$8,0)))","v":""},{"$f":"IF(J34=0,\"\",INDEX(Risk_Factors!$O$23:$T$25,MATCH('1_Risk_Calc'!J34,Dust_composition,0),MATCH($E34,Risk_Factors!$O$8:$T$8,0)))","v":""},{"$f":"IF(K34=0,\"\",INDEX(Risk_Factors!$O$26:$T$28,MATCH('1_Risk_Calc'!K34,Dust_size,0),MATCH($E34,Risk_Factors!$O$8:$T$8,0)))","v":""},{"$f":"IF(L34=0,\"\",INDEX(Risk_Factors!$O$29:$T$30,MATCH('1_Risk_Calc'!L34,Risk_Factors!$E$29:$E$30,0),MATCH($E34,Risk_Factors!$O$8:$T$8,0)))","v":""},{"$f":"IF(M34=0,\"\",INDEX(Risk_Factors!$O$32:$T$33,MATCH('1_Risk_Calc'!M34,Risk_Factors!$E$32:$E$33,0),MATCH($E34,Risk_Factors!$O$8:$T$8,0)))","v":""},{"$f":"IF(N34=0,\"\",INDEX(Risk_Factors!$O$35:$T$36,MATCH('1_Risk_Calc'!N34,Risk_Factors!$E$35:$E$36,0),MATCH($E34,Risk_Factors!$O$8:$T$8,0)))","v":""},{"$f":"IF(O34=0,\"\",INDEX(Risk_Factors!$O$38:$T$39,MATCH('1_Risk_Calc'!O34,Risk_Factors!$E$38:$E$39,0),MATCH($E34,Risk_Factors!$O$8:$T$8,0)))","v":""},{"$f":"IF(P34=0,\"\",INDEX(Risk_Factors!$O$41:$T$42,MATCH('1_Risk_Calc'!P34,Risk_Factors!$E$41:$E$42,0),MATCH($E34,Risk_Factors!$O$8:$T$8,0)))","v":""},0,0,null,null,null,"S_025",0]
[null,"S_026",null,null,null,null,null,null,null,null,null,null,null,null,null,null,{"$f":"IF(F35=0,\"\",INDEX(Risk_Factors!$O$12:$T$14,MATCH(F35,Frequency,0),MATCH($E35,Risk_Factors!$O$8:$T$8,0)))","v":""},{"$f":"IF(G35=0,\"\",INDEX(Risk_Factors!$O$15:$T$17,MATCH('1_Risk_Calc'!G35,Position,0),MATCH($E35,Risk_Factors!$O$8:$T$8,0)))","v":""},{"$f":"IF(H35=0,\"\",INDEX(Risk_Factors!$O$18:$T$19,MATCH('1_Risk_Calc'!H35,Yes_No,0),MATCH($E35,Risk_Factors!$O$8:$T$8,0)))","v":""},{"$f":"IF(I35=0,\"\",INDEX(Risk_Factors!$O$20:$T$22,MATCH('1_Risk_Calc'!I35,Dust_amount,0),MATCH($E35,Risk_Factors!$O$8:$T$8,0)))","v":""},{"$f":"IF(J35=0,\"\",INDEX(Risk_Factors!$O$23:$T$25,MATCH('1_Risk_Calc'!J35,Dust_composition,0),MATCH($E35,Risk_Factors!$O$8:$T$8,0)))","v":""},{"$f":"IF(K35=0,\"\",INDEX(Risk_Factors!$O$26:$T$28,MATCH('1_Risk_Calc'!K35,Dust_size,0),MATCH($E35,Risk_Factors!$O$8:$T$8,0)))","v":""},{"$f":"IF(L35=0,\"\",INDEX(Risk_Factors!$O$29:$T$30,MATCH('1_Risk_Calc'!L35,Risk_Factors!$E$29:$E$30,0),MATCH($E35,Risk_Factors!$O$8:$T$8,0)))","v":""},{"$f":"IF(M35=0,\"\",INDEX(Risk_Factors!$O$32:$T$33,MATCH('1_Risk_Calc'!M35,Risk_Factors!$E$32:$E$33,0),MATCH($E35,Risk_Factors!$O$8:$T$8,0)))","v":""},{"$f":"IF(N35=0,\"\",INDEX(Risk_Factors!$O$35:$T$36,MATCH('1_Risk_Calc'!N35,Risk_Factors!$E$35:$E$36,0),MATCH($E35,Risk_Factors!$O$8:$T$8,0)))","v":""},{"$f":"IF(O35=0,\"\",INDEX(Risk_Factors!$O$38:$T$39,MATCH('1_Risk_Calc'!O35,Risk_Factors!$E$38:$E$39,0),MATCH($E35,Risk_Factors!$O$8:$T$8,0)))","v":""},{"$f":"IF(P35=0,\"\",INDEX(Risk_Factors!$O$41:$T$42,MATCH('1_Risk_Calc'!P35,Risk_Factors!$E$41:$E$42,0),MATCH($E35,Risk_Factors!$O$8:$T$8,0)))","v":""},0,0,null,null,null,"S_026",0]
[null,"S_027",null,null,null,null,null,null,null,null,null,null,null,null,null,null,{"$f":"IF(F36=0,\"\",INDEX(Risk_Factors!$O$12:$T$14,MATCH(F36,Frequency,0),MATCH($E36,Risk_Factors!$O$8:$T$8,0)))","v":""},{"$f":"IF(G36=0,\"\",INDEX(Risk_Factors!$O$15:$T$17,MATCH('1_Risk_Calc'!G36,Position,0),MATCH($E36,Risk_Factors!$O$8:$T$8,0)))","v":""},{"$f":"IF(H36=0,\"\",INDEX(Risk_Factors!$O$18:$T$19,MATCH('1_Risk_Calc'!H36,Yes_No,0),MATCH($E36,Risk_Factors!$O$8:$T$8,0)))","v":""},{"$f":"IF(I36=0,\"\",INDEX(Risk_Factors!$O$20:$T$22,MATCH('1_Risk_Calc'!I36,Dust_amount,0),MATCH($E36,Risk_Factors!$O$8:$T$8,0)))","v":""},{"$f":"IF(J36=0,\"\",INDEX(Risk_Factors!$O$23:$T$25,MATCH('1_Risk_Calc'!J36,Dust_composition,0),MATCH($E36,Risk_Factors!$O$8:$T$8,0)))","v":""},{"$f":"IF(K36=0,\"\",INDEX(Risk_Factors!$O$26:$T$28,MATCH('1_Risk_Calc'!K36,Dust_size,0),MATCH($E36,Risk_Factors!$O$8:$T$8,0)))","v":""},{"$f":"IF(L36=0,\"\",INDEX(Risk_Factors!$O$29:$T$30,MATCH('1_Risk_Calc'!L36,Risk_Factors!$E$29:$E$30,0),MATCH($E36,Risk_Factors!$O$8:$T$8,0)))","v":""},{"$f":"IF(M36=0,\"\",INDEX(Risk_Factors!$O$32:$T$33,MATCH('1_Risk_Calc'!M36,Risk_Factors!$E$32:$E$33,0),MATCH($E36,Risk_Factors!$O$8:$T$8,0)))","v":""},{"$f":"IF(N36=0,\"\",INDEX(Risk_Factors!$O$35:$T$36,MATCH('1_Risk_Calc'!N36,Risk_Factors!$E$35:$E$36,0),MATCH($E36,Risk_Factors!$O$8:$T$8,0)))","v":""},{"$f":"IF(O36=0,\"\",INDEX(Risk_Factors!$O$38:$T$39,MATCH('1_Risk_Calc'!O36,Risk_Factors!$E$38:$E$39,0),MATCH($E36,Risk_Factors!$O$8:$T$8,0)))","v":""},{"$f":"IF(P36=0,\"\",INDEX(Risk_Factors!$O$41:$T$42,MATCH('1_Risk_Calc'!P36,Risk_Factors!$E$41:$E$42,0),MATCH($E36,Risk_Factors!$O$8:$T$8,0)))","v":""},0,0,null,null,null,"S_027",0]
[null,"S_028",null,null,null,null,null,null,null,null,null,null,null,null,null,null,{"$f":"IF(F37=0,\"\",INDEX(Risk_Factors!$O$12:$T$14,MATCH(F37,Frequency,0),MATCH($E37,Risk_Factors!$O$8:$T$8,0)))","v":""},{"$f":"IF(G37=0,\"\",INDEX(Risk_Factors!$O$15:$T$17,MATCH('1_Risk_Calc'!G37,Position,0),MATCH($E37,Risk_Factors!$O$8:$T$8,0)))","v":""},{"$f":"IF(H37=0,\"\",INDEX(Risk_Factors!$O$18:$T$19,MATCH('1_Risk_Calc'!H37,Yes_No,0),MATCH($E37,Risk_Factors!$O$8:$T$8,0)))","v":""},{"$f":"IF(I37=0,\"\",INDEX(Risk_Factors!$O$20:$T$22,MATCH('1_Risk_Calc'!I37,Dust_amount,0),MATCH($E37,Risk_Factors!$O$8:$T$8,0)))","v":""},{"$f":"IF(J37=0,\"\",INDEX(Risk_Factors!$O$23:$T$25,MATCH('1_Risk_Calc'!J37,Dust_composition,0),MATCH($E37,Risk_Factors!$O$8:$T$8,0)))","v":""},{"$f":"IF(K37=0,\"\",INDEX(Risk_Factors!$O$26:$T$28,MATCH('1_Risk_Calc'!K37,Dust_size,0),MATCH($E37,Risk_Factors!$O$8:$T$8,0)))","v":""},{"$f":"IF(L37=0,\"\",INDEX(Risk_Factors!$O$29:$T$30,MATCH('1_Risk_Calc'!L37,Risk_Factors!$E$29:$E$30,0),MATCH($E37,Risk_Factors!$O$8:$T$8,0)))","v":""},{"$f":"IF(M37=0,\"\",INDEX(Risk_Factors!$O$32:$T$33,MATCH('1_Risk_Calc'!M37,Risk_Factors!$E$32:$E$33,0),MATCH($E37,Risk_Factors!$O$8:$T$8,0)))","v":""},{"$f":"IF(N37=0,\"\",INDEX(Risk_Factors!$O$35:$T$36,MATCH('1_Risk_Calc'!N37,Risk_Factors!$E$35:$E$36,0),MATCH($E37,Risk_Factors!$O$8:$T$8,0)))","v":""},{"$f":"IF(O37=0,\"\",INDEX(Risk_Factors!$O$38:$T$39,MATCH('1_Risk_Calc'!O37,Risk_Factors!$E$38:$E$39,0),MATCH($E37,Risk_Factors!$O$8:$T$8,0)))","v":""},{"$f":"IF(P37=0,\"\",INDEX(Risk_Factors!$O$41:$T$42,MATCH('1_Risk_Calc'!P37,Risk_Factors!$E$41:$E$42,0),MATCH($E37,Risk_Factors!$O$8:$T$8,0)))","v":""},0,0,null,null,null,"S_028",0]
[null,"S_029",null,null,null,null,null,null,null,null,null,null,null,null,null,null,{"$f":"IF(F38=0,\"\",INDEX(Risk_Factors!$O$12:$T$14,MATCH(F38,Frequency,0),MATCH($E38,Risk_Factors!$O$8:$T$8,0)))","v":""},{"$f":"IF(G38=0,\"\",INDEX(Risk_Factors!$O$15:$T$17,MATCH('1_Risk_Calc'!G38,Position,0),MATCH($E38,Risk_Factors!$O$8:$T$8,0)))","v":""},{"$f":"IF(H38=0,\"\",INDEX(Risk_Factors!$O$18:$T$19,MATCH('1_Risk_Calc'!H38,Yes_No,0),MATCH($E38,Risk_Factors!$O$8:$T$8,0)))","v":""},{"$f":"IF(I38=0,\"\",INDEX(Risk_Factors!$O$20:$T$22,MATCH('1_Risk_Calc'!I38,Dust_amount,0),MATCH($E38,Risk_Factors!$O$8:$T$8,0)))","v":""},{"$f":"IF(J38=0,\"\",INDEX(Risk_Factors!$O$23:$T$25,MATCH('1_Risk_Calc'!J38,Dust_composition,0),MATCH($E38,Risk_Factors!$O$8:$T$8,0)))","v":""},{"$f":"IF(K38=0,\"\",INDEX(Risk_Factors!$O$26:$T$28,MATCH('1_Risk_Calc'!K38,Dust_size,0),MATCH($E38,Risk_Factors!$O$8:$T$8,0)))","v":""},{"$f":"IF(L38=0,\"\",INDEX(Risk_Factors!$O$29:$T$30,MATCH('1_Risk_Calc'!L38,Risk_Factors!$E$29:$E$30,0),MATCH($E38,Risk_Factors!$O$8:$T$8,0)))","v":""},{"$f":"IF(M38=0,\"\",INDEX(Risk_Factors!$O$32:$T$33,MATCH('1_Risk_Calc'!M38,Risk_Factors!$E$32:$E$33,0),MATCH($E38,Risk_Factors!$O$8:$T$8,0)))","v":""},{"$f":"IF(N38=0,\"\",INDEX(Risk_Factors!$O$35:$T$36,MATCH('1_Risk_Calc'!N38,Risk_Factors!$E$35:$E$36,0),MATCH($E38,Risk_Factors!$O$8:$T$8,0)))","v":""},{"$f":"IF(O38=0,\"\",INDEX(Risk_Factors!$O$38:$T$39,MATCH('1_Risk_Calc'!O38,Risk_Factors!$E$38:$E$39,0),MATCH($E38,Risk_Factors!$O$8:$T$8,0)))","v":""},{"$f":"IF(P38=0,\"\",INDEX(Risk_Factors!$O$41:$T$42,MATCH('1_Risk_Calc'!P38,Risk_Factors!$E$41:$E$42,0),MATCH($E38,Risk_Factors!$O$8:$T$8,0)))","v":""},0,0,null,null,null,"S_029",0]
[null,"S_030",null,null,null,null,null,null,null,null,null,null,null,null,null,null,{"$f":"IF(F39=0,\"\",INDEX(Risk_Factors!$O$12:$T$14,MATCH(F39,Frequency,0),MATCH($E39,Risk_Factors!$O$8:$T$8,0)))","v":""},{"$f":"IF(G39=0,\"\",INDEX(Risk_Factors!$O$15:$T$17,MATCH('1_Risk_Calc'!G39,Position,0),MATCH($E39,Risk_Factors!$O$8:$T$8,0)))","v":""},{"$f":"IF(H39=0,\"\",INDEX(Risk_Factors!$O$18:$T$19,MATCH('1_Risk_Calc'!H39,Yes_No,0),MATCH($E39,Risk_Factors!$O$8:$T$8,0)))","v":""},{"$f":"IF(I39=0,\"\",INDEX(Risk_Factors!$O$20:$T$22,MATCH('1_Risk_Calc'!I39,Dust_amount,0),MATCH($E39,Risk_Factors!$O$8:$T$8,0)))","v":""},{"$f":"IF(J39=0,\"\",INDEX(Risk_Factors!$O$23:$T$25,MATCH('1_Risk_Calc'!J39,Dust_composition,0),MATCH($E39,Risk_Factors!$O$8:$T$8,0)))","v":""},{"$f":"IF(K39=0,\"\",INDEX(Risk_Factors!$O$26:$T$28,MATCH('1_Risk_Calc'!K39,Dust_size,0),MATCH($E39,Risk_Factors!$O$8:$T$8,0)))","v":""},{"$f":"IF(L39=0,\"\",INDEX(Risk_Factors!$O$29:$T$30,MATCH('1_Risk_Calc'!L39,Risk_Factors!$E$29:$E$30,0),MATCH($E39,Risk_Factors!$O$8:$T$8,0)))","v":""},{"$f":"IF(M39=0,\"\",INDEX(Risk_Factors!$O$32:$T$33,MATCH('1_Risk_Calc'!M39,Risk_Factors!$E$32:$E$33,0),MATCH($E39,Risk_Factors!$O$8:$T$8,0)))","v":""},{"$f":"IF(N39=0,\"\",INDEX(Risk_Factors!$O$35:$T$36,MATCH('1_Risk_Calc'!N39,Risk_Factors!$E$35:$E$36,0),MATCH($E39,Risk_Factors!$O$8:$T$8,0)))","v":""},{"$f":"IF(O39=0,\"\",INDEX(Risk_Factors!$O$38:$T$39,MATCH('1_Risk_Calc'!O39,Risk_Factors!$E$38:$E$39,0),MATCH($E39,Risk_Factors!$O$8:$T$8,0)))","v":""},{"$f":"IF(P39=0,\"\",INDEX(Risk_Factors!$O$41:$T$42,MATCH('1_Risk_Calc'!P39,Risk_Factors!$E$41:$E$42,0),MATCH($E39,Risk_Factors!$O$8:$T$8,0)))","v":""},0,0,null,null,null,"S_030",0]
[null,"S_031",null,null,null,null,null,null,null,null,null,null,null,null,null,null,{"$f":"IF(F40=0,\"\",INDEX(Risk_Factors!$O$12:$T$14,MATCH(F40,Frequency,0),MATCH($E40,Risk_Factors!$O$8:$T$8,0)))","v":""},{"$f":"IF(G40=0,\"\",INDEX(Risk_Factors!$O$15:$T$17,MATCH('1_Risk_Calc'!G40,Position,0),MATCH($E40,Risk_Factors!$O$8:$T$8,0)))","v":""},{"$f":"IF(H40=0,\"\",INDEX(Risk_Factors!$O$18:$T$19,MATCH('1_Risk_Calc'!H40,Yes_No,0),MATCH($E40,Risk_Factors!$O$8:$T$8,0)))","v":""},{"$f":"IF(I40=0,\"\",INDEX(Risk_Factors!$O$20:$T$22,MATCH('1_Risk_Calc'!I40,Dust_amount,0),MATCH($E40,Risk_Factors!$O$8:$T$8,0)))","v":""},{"$f":"IF(J40=0,\"\",INDEX(Risk_Factors!$O$23:$T$25,MATCH('1_Risk_Calc'!J40,Dust_composition,0),MATCH($E40,Risk_Factors!$O$8:$T$8,0)))","v":""},{"$f":"IF(K40=0,\"\",INDEX(Risk_Factors!$O$26:$T$28,MATCH('1_Risk_Calc'!K40,Dust_size,0),MATCH($E40,Risk_Factors!$O$8:$T$8,0)))","v":""},{"$f":"IF(L40=0,\"\",INDEX(Risk_Factors!$O$29:$T$30,MATCH('1_Risk_Calc'!L40,Risk_Factors!$E$29:$E$30,0),MATCH($E40,Risk_Factors!$O$8:$T$8,0)))","v":""},{"$f":"IF(M40=0,\"\",INDEX(Risk_Factors!$O$32:$T$33,MATCH('1_Risk_Calc'!M40,Risk_Factors!$E$32:$E$33,0),MATCH($E40,Risk_Factors!$O$8:$T$8,0)))","v":""},{"$f":"IF(N40=0,\"\",INDEX(Risk_Factors!$O$35:$T$36,MATCH('1_Risk_Calc'!N40,Risk_Factors!$E$35:$E$36,0),MATCH($E40,Risk_Factors!$O$8:$T$8,0)))","v":""},{"$f":"IF(O40=0,\"\",INDEX(Risk_Factors!$O$38:$T$39,MATCH('1_Risk_Calc'!O40,Risk_Factors!$E$38:$E$39,0),MATCH($E40,Risk_Factors!$O$8:$T$8,0)))","v":""},{"$f":"IF(P40=0,\"\",INDEX(Risk_Factors!$O$41:$T$42,MATCH('1_Risk_Calc'!P40,Risk_Factors!$E$41:$E$42,0),MATCH($E40,Risk_Factors!$O$8:$T$8,0)))","v":""},0,0,null,null,null,"S_031",0]
[null,"S_032",null,null,null,null,null,null,null,null,null,null,null,null,null,null,{"$f":"IF(F41=0,\"\",INDEX(Risk_Factors!$O$12:$T$14,MATCH(F41,Frequency,0),MATCH($E41,Risk_Factors!$O$8:$T$8,0)))","v":""},{"$f":"IF(G41=0,\"\",INDEX(Risk_Factors!$O$15:$T$17,MATCH('1_Risk_Calc'!G41,Position,0),MATCH($E41,Risk_Factors!$O$8:$T$8,0)))","v":""},{"$f":"IF(H41=0,\"\",INDEX(Risk_Factors!$O$18:$T$19,MATCH('1_Risk_Calc'!H41,Yes_No,0),MATCH($E41,Risk_Factors!$O$8:$T$8,0)))","v":""},{"$f":"IF(I41=0,\"\",INDEX(Risk_Factors!$O$20:$T$22,MATCH('1_Risk_Calc'!I41,Dust_amount,0),MATCH($E41,Risk_Factors!$O$8:$T$8,0)))","v":""},{"$f":"IF(J41=0,\"\",INDEX(Risk_Factors!$O$23:$T$25,MATCH('1_Risk_Calc'!J41,Dust_composition,0),MATCH($E41,Risk_Factors!$O$8:$T$8,0)))","v":""},{"$f":"IF(K41=0,\"\",INDEX(Risk_Factors!$O$26:$T$28,MATCH('1_Risk_Calc'!K41,Dust_size,0),MATCH($E41,Risk_Factors!$O$8:$T$8,0)))","v":""},{"$f":"IF(L41=0,\"\",INDEX(Risk_Factors!$O$29:$T$30,MATCH('1_Risk_Calc'!L41,Risk_Factors!$E$29:$E$30,0),MATCH($E41,Risk_Factors!$O$8:$T$8,0)))","v":""},{"$f":"IF(M41=0,\"\",INDEX(Risk_Factors!$O$32:$T$33,MATCH('1_Risk_Calc'!M41,Risk_Factors!$E$32:$E$33,0),MATCH($E41,Risk_Factors!$O$8:$T$8,0)))","v":""},{"$f":"IF(N41=0,\"\",INDEX(Risk_Factors!$O$35:$T$36,MATCH('1_Risk_Calc'!N41,Risk_Factors!$E$35:$E$36,0),MATCH($E41,Risk_Factors!$O$8:$T$8,0)))","v":""},{"$f":"IF(O41=0,\"\",INDEX(Risk_Factors!$O$38:$T$39,MATCH('1_Risk_Calc'!O41,Risk_Factors!$E$38:$E$39,0),MATCH($E41,Risk_Factors!$O$8:$T$8,0)))","v":""},{"$f":"IF(P41=0,\"\",INDEX(Risk_Factors!$O$41:$T$42,MATCH('1_Risk_Calc'!P41,Risk_Factors!$E$41:$E$42,0),MATCH($E41,Risk_Factors!$O$8:$T$8,0)))","v":""},0,0,null,null,null,"S_032",0]
[null,"S_033",null,null,null,null,null,null,null,null,null,null,null,null,null,null,{"$f":"IF(F42=0,\"\",INDEX(Risk_Factors!$O$12:$T$14,MATCH(F42,Frequency,0),MATCH($E42,Risk_Factors!$O$8:$T$8,0)))","v":""},{"$f":"IF(G42=0,\"\",INDEX(Risk_Factors!$O$15:$T$17,MATCH('1_Risk_Calc'!G42,Position,0),MATCH($E42,Risk_Factors!$O$8:$T$8,0)))","v":""},{"$f":"IF(H42=0,\"\",INDEX(Risk_Factors!$O$18:$T$19,MATCH('1_Risk_Calc'!H42,Yes_No,0),MATCH($E42,Risk_Factors!$O$8:$T$8,0)))","v":""},{"$f":"IF(I42=0,\"\",INDEX(Risk_Factors!$O$20:$T$22,MATCH('1_Risk_Calc'!I42,Dust_amount,0),MATCH($E42,Risk_Factors!$O$8:$T$8,0)))","v":""},{"$f":"IF(J42=0,\"\",INDEX(Risk_Factors!$O$23:$T$25,MATCH('1_Risk_Calc'!J42,Dust_composition,0),MATCH($E42,Risk_Factors!$O$8:$T$8,0)))","v":""},{"$f":"IF(K42=0,\"\",INDEX(Risk_Factors!$O$26:$T$28,MATCH('1_Risk_Calc'!K42,Dust_size,0),MATCH($E42,Risk_Factors!$O$8:$T$8,0)))","v":""},{"$f":"IF(L42=0,\"\",INDEX(Risk_Factors!$O$29:$T$30,MATCH('1_Risk_Calc'!L42,Risk_Factors!$E$29:$E$30,0),MATCH($E42,Risk_Factors!$O$8:$T$8,0)))","v":""},{"$f":"IF(M42=0,\"\",INDEX(Risk_Factors!$O$32:$T$33,MATCH('1_Risk_Calc'!M42,Risk_Factors!$E$32:$E$33,0),MATCH($E42,Risk_Factors!$O$8:$T$8,0)))","v":""},{"$f":"IF(N42=0,\"\",INDEX(Risk_Factors!$O$35:$T$36,MATCH('1_Risk_Calc'!N42,Risk_Factors!$E$35:$E$36,0),MATCH($E42,Risk_Factors!$O$8:$T$8,0)))","v":""},{"$f":"IF(O42=0,\"\",INDEX(Risk_Factors!$O$38:$T$39,MATCH('1_Risk_Calc'!O42,Risk_Factors!$E$38:$E$39,0),MATCH($E42,Risk_Factors!$O$8:$T$8,0)))","v":""},{"$f":"IF(P42=0,\"\",INDEX(Risk_Factors!$O$41:$T$42,MATCH('1_Risk_Calc'!P42,Risk_Factors!$E$41:$E$42,0),MATCH($E42,Risk_Factors!$O$8:$T$8,0)))","v":""},0,{"$f":"(AB42/MAX($AB$10:$AB$109))*$AC$5","v":0},null,null,null,"S_033",0]
[null,"S_034",null,null,null,null,null,null,null,null,null,null,null,null,null,null,{"$f":"IF(F43=0,\"\",INDEX(Risk_Factors!$O$12:$T$14,MATCH(F43,Frequency,0),MATCH($E43,Risk_Factors!$O$8:$T$8,0)))","v":""},{"$f":"IF(G43=0,\"\",INDEX(Risk_Factors!$O$15:$T$17,MATCH('1_Risk_Calc'!G43,Position,0),MATCH($E43,Risk_Factors!$O$8:$T$8,0)))","v":""},{"$f":"IF(H43=0,\"\",INDEX(Risk_Factors!$O$18:$T$19,MATCH('1_Risk_Calc'!H43,Yes_No,0),MATCH($E43,Risk_Factors!$O$8:$T$8,0)))","v":""},{"$f":"IF(I43=0,\"\",INDEX(Risk_Factors!$O$20:$T$22,MATCH('1_Risk_Calc'!I43,Dust_amount,0),MATCH($E43,Risk_Factors!$O$8:$T$8,0)))","v":""},{"$f":"IF(J43=0,\"\",INDEX(Risk_Factors!$O$23:$T$25,MATCH('1_Risk_Calc'!J43,Dust_composition,0),MATCH($E43,Risk_Factors!$O$8:$T$8,0)))","v":""},{"$f":"IF(K43=0,\"\",INDEX(Risk_Factors!$O$26:$T$28,MATCH('1_Risk_Calc'!K43,Dust_size,0),MATCH($E43,Risk_Factors!$O$8:$T$8,0)))","v":""},{"$f":"IF(L43=0,\"\",INDEX(Risk_Factors!$O$29:$T$30,MATCH('1_Risk_Calc'!L43,Risk_Factors!$E$29:$E$30,0),MATCH($E43,Risk_Factors!$O$8:$T$8,0)))","v":""},{"$f":"IF(M43=0,\"\",INDEX(Risk_Factors!$O$32:$T$33,MATCH('1_Risk_Calc'!M43,Risk_Factors!$E$32:$E$33,0),MATCH($E43,Risk_Factors!$O$8:$T$8,0)))","v":""},{"$f":"IF(N43=0,\"\",INDEX(Risk_Factors!$O$35:$T$36,MATCH('1_Risk_Calc'!N43,Risk_Factors!$E$35:$E$36,0),MATCH($E43,Risk_Factors!$O$8:$T$8,0)))","v":""},{"$f":"IF(O43=0,\"\",INDEX(Risk_Factors!$O$38:$T$39,MATCH('1_Risk_Calc'!O43,Risk_Factors!$E$38:$E$39,0),MATCH($E43,Risk_Factors!$O$8:$T$8,0)))","v":""},{"$f":"IF(P43=0,\"\",INDEX(Risk_Factors!$O$41:$T$42,MATCH('1_Risk_Calc'!P43,Risk_Factors!$E$41:$E$42,0),MATCH($E43,Risk_Factors!$O$8:$T$8,0)))","v":""},0,0,null,null,null,"S_034",0]
[null,"S_035",null,null,null,null,null,null,null,null,null,null,null,null,null,null,{"$f":"IF(F44=0,\"\",INDEX(Risk_Factors!$O$12:$T$14,MATCH(F44,Frequency,0),MATCH($E44,Risk_Factors!$O$8:$T$8,0)))","v":""},{"$f":"IF(G44=0,\"\",INDEX(Risk_Factors!$O$15:$T$17,MATCH('1_Risk_Calc'!G44,Position,0),MATCH($E44,Risk_Factors!$O$8:$T$8,0)))","v":""},{"$f":"IF(H44=0,\"\",INDEX(Risk_Factors!$O$18:$T$19,MATCH('1_Risk_Calc'!H44,Yes_No,0),MATCH($E44,Risk_Factors!$O$8:$T$8,0)))","v":""},{"$f":"IF(I44=0,\"\",INDEX(Risk_Factors!$O$20:$T$22,MATCH('1_Risk_Calc'!I44,Dust_amount,0),MATCH($E44,Risk_Factors!$O$8:$T$8,0)))","v":""},{"$f":"IF(J44=0,\"\",INDEX(Risk_Factors!$O$23:$T$25,MATCH('1_Risk_Calc'!J44,Dust_composition,0),MATCH($E44,Risk_Factors!$O$8:$T$8,0)))","v":""},{"$f":"IF(K44=0,\"\",INDEX(Risk_Factors!$O$26:$T$28,MATCH('1_Risk_Calc'!K44,Dust_size,0),MATCH($E44,Risk_Factors!$O$8:$T$8,0)))","v":""},{"$f":"IF(L44=0,\"\",INDEX(Risk_Factors!$O$29:$T$30,MATCH('1_Risk_Calc'!L44,Risk_Factors!$E$29:$E$30,0),MATCH($E44,Risk_Factors!$O$8:$T$8,0)))","v":""},{"$f":"IF(M44=0,\"\",INDEX(Risk_Factors!$O$32:$T$33,MATCH('1_Risk_Calc'!M44,Risk_Factors!$E$32:$E$33,0),MATCH($E44,Risk_Factors!$O$8:$T$8,0)))","v":""},{"$f":"IF(N44=0,\"\",INDEX(Risk_Factors!$O$35:$T$36,MATCH('1_Risk_Calc'!N44,Risk_Factors!$E$35:$E$36,0),MATCH($E44,Risk_Factors!$O$8:$T$8,0)))","v":""},{"$f":"IF(O44=0,\"\",INDEX(Risk_Factors!$O$38:$T$39,MATCH('1_Risk_Calc'!O44,Risk_Factors!$E$38:$E$39,0),MATCH($E44,Risk_Factors!$O$8:$T$8,0)))","v":""},{"$f":"IF(P44=0,\"\",INDEX(Risk_Factors!$O$41:$T$42,MATCH('1_Risk_Calc'!P44,Risk_Factors!$E$41:$E$42,0),MATCH($E44,Risk_Factors!$O$8:$T$8,0)))","v":""},0,0,null,null,null,"S_035",0]
[null,"S_036",null,null,null,null,null,null,null,null,null,null,null,null,null,null,{"$f":"IF(F45=0,\"\",INDEX(Risk_Factors!$O$12:$T$14,MATCH(F45,Frequency,0),MATCH($E45,Risk_Factors!$O$8:$T$8,0)))","v":""},{"$f":"IF(G45=0,\"\",INDEX(Risk_Factors!$O$15:$T$17,MATCH('1_Risk_Calc'!G45,Position,0),MATCH($E45,Risk_Factors!$O$8:$T$8,0)))","v":""},{"$f":"IF(H45=0,\"\",INDEX(Risk_Factors!$O$18:$T$19,MATCH('1_Risk_Calc'!H45,Yes_No,0),MATCH($E45,Risk_Factors!$O$8:$T$8,0)))","v":""},{"$f":"IF(I45=0,\"\",INDEX(Risk_Factors!$O$20:$T$22,MATCH('1_Risk_Calc'!I45,Dust_amount,0),MATCH($E45,Risk_Factors!$O$8:$T$8,0)))","v":""},{"$f":"IF(J45=0,\"\",INDEX(Risk_Factors!$O$23:$T$25,MATCH('1_Risk_Calc'!J45,Dust_composition,0),MATCH($E45,Risk_Factors!$O$8:$T$8,0)))","v":""},{"$f":"IF(K45=0,\"\",INDEX(Risk_Factors!$O$26:$T$28,MATCH('1_Risk_Calc'!K45,Dust_size,0),MATCH($E45,Risk_Factors!$O$8:$T$8,0)))","v":""},{"$f":"IF(L45=0,\"\",INDEX(Risk_Factors!$O$29:$T$30,MATCH('1_Risk_Calc'!L45,Risk_Factors!$E$29:$E$30,0),MATCH($E45,Risk_Factors!$O$8:$T$8,0)))","v":""},{"$f":"IF(M45=0,\"\",INDEX(Risk_Factors!$O$32:$T$33,MATCH('1_Risk_Calc'!M45,Risk_Factors!$E$32:$E$33,0),MATCH($E45,Risk_Factors!$O$8:$T$8,0)))","v":""},{"$f":"IF(N45=0,\"\",INDEX(Risk_Factors!$O$35:$T$36,MATCH('1_Risk_Calc'!N45,Risk_Factors!$E$35:$E$36,0),MATCH($E45,Risk_Factors!$O$8:$T$8,0)))","v":""},{"$f":"IF(O45=0,\"\",INDEX(Risk_Factors!$O$38:$T$39,MATCH('1_Risk_Calc'!O45,Risk_Factors!$E$38:$E$39,0),MATCH($E45,Risk_Factors!$O$8:$T$8,0)))","v":""},{"$f":"IF(P45=0,\"\",INDEX(Risk_Factors!$O$41:$T$42,MATCH('1_Risk_Calc'!P45,Risk_Factors!$E$41:$E$42,0),MATCH($E45,Risk_Factors!$O$8:$T$8,0)))","v":""},0,0,null,null,null,"S_036",0]
[null,"S_037",null,null,null,null,null,null,null,null,null,null,null,null,null,null,{"$f":"IF(F46=0,\"\",INDEX(Risk_Factors!$O$12:$T$14,MATCH(F46,Frequency,0),MATCH($E46,Risk_Factors!$O$8:$T$8,0)))","v":""},{"$f":"IF(G46=0,\"\",INDEX(Risk_Factors!$O$15:$T$17,MATCH('1_Risk_Calc'!G46,Position,0),MATCH($E46,Risk_Factors!$O$8:$T$8,0)))","v":""},{"$f":"IF(H46=0,\"\",INDEX(Risk_Factors!$O$18:$T$19,MATCH('1_Risk_Calc'!H46,Yes_No,0),MATCH($E46,Risk_Factors!$O$8:$T$8,0)))","v":""},{"$f":"IF(I46=0,\"\",INDEX(Risk_Factors!$O$20:$T$22,MATCH('1_Risk_Calc'!I46,Dust_amount,0),MATCH($E46,Risk_Factors!$O$8:$T$8,0)))","v":""},{"$f":"IF(J46=0,\"\",INDEX(Risk_Factors!$O$23:$T$25,MATCH('1_Risk_Calc'!J46,Dust_composition,0),MATCH($E46,Risk_Factors!$O$8:$T$8,0)))","v":""},{"$f":"IF(K46=0,\"\",INDEX(Risk_Factors!$O$26:$T$28,MATCH('1_Risk_Calc'!K46,Dust_size,0),MATCH($E46,Risk_Factors!$O$8:$T$8,0)))","v":""},{"$f":"IF(L46=0,\"\",INDEX(Risk_Factors!$O$29:$T$30,MATCH('1_Risk_Calc'!L46,Risk_Factors!$E$29:$E$30,0),MATCH($E46,Risk_Factors!$O$8:$T$8,0)))","v":""},{"$f":"IF(M46=0,\"\",INDEX(Risk_Factors!$O$32:$T$33,MATCH('1_Risk_Calc'!M46,Risk_Factors!$E$32:$E$33,0),MATCH($E46,Risk_Factors!$O$8:$T$8,0)))","v":""},{"$f":"IF(N46=0,\"\",INDEX(Risk_Factors!$O$35:$T$36,MATCH('1_Risk_Calc'!N46,Risk_Factors!$E$35:$E$36,0),MATCH($E46,Risk_Factors!$O$8:$T$8,0)))","v":""},{"$f":"IF(O46=0,\"\",INDEX(Risk_Factors!$O$38:$T$39,MATCH('1_Risk_Calc'!O46,Risk_Factors!$E$38:$E$39,0),MATCH($E46,Risk_Factors!$O$8:$T$8,0)))","v":""},{"$f":"IF(P46=0,\"\",INDEX(Risk_Factors!$O$41:$T$42,MATCH('1_Risk_Calc'!P46,Risk_Factors!$E$41:$E$42,0),MATCH($E46,Risk_Factors!$O$8:$T$8,0)))","v":""},0,0,null,null,null,"S_037",0]
[null,"S_038",null,null,null,null,null,null,null,null,null,null,null,null,null,null,{"$f":"IF(F47=0,\"\",INDEX(Risk_Factors!$O$12:$T$14,MATCH(F47,Frequency,0),MATCH($E47,Risk_Factors!$O$8:$T$8,0)))","v":""},{"$f":"IF(G47=0,\"\",INDEX(Risk_Factors!$O$15:$T$17,MATCH('1_Risk_Calc'!G47,Position,0),MATCH($E47,Risk_Factors!$O$8:$T$8,0)))","v":""},{"$f":"IF(H47=0,\"\",INDEX(Risk_Factors!$O$18:$T$19,MATCH('1_Risk_Calc'!H47,Yes_No,0),MATCH($E47,Risk_Factors!$O$8:$T$8,0)))","v":""},{"$f":"IF(I47=0,\"\",INDEX(Risk_Factors!$O$20:$T$22,MATCH('1_Risk_Calc'!I47,Dust_amount,0),MATCH($E47,Risk_Factors!$O$8:$T$8,0)))","v":""},{"$f":"IF(J47=0,\"\",INDEX(Risk_Factors!$O$23:$T$25,MATCH('1_Risk_Calc'!J47,Dust_composition,0),MATCH($E47,Risk_Factors!$O$8:$T$8,0)))","v":""},{"$f":"IF(K47=0,\"\",INDEX(Risk_Factors!$O$26:$T$28,MATCH('1_Risk_Calc'!K47,Dust_size,0),MATCH($E47,Risk_Factors!$O$8:$T$8,0)))","v":""},{"$f":"IF(L47=0,\"\",INDEX(Risk_Factors!$O$29:$T$30,MATCH('1_Risk_Calc'!L47,Risk_Factors!$E$29:$E$30,0),MATCH($E47,Risk_Factors!$O$8:$T$8,0)))","v":""},{"$f":"IF(M47=0,\"\",INDEX(Risk_Factors!$O$32:$T$33,MATCH('1_Risk_Calc'!M47,Risk_Factors!$E$32:$E$33,0),MATCH($E47,Risk_Factors!$O$8:$T$8,0)))","v":""},{"$f":"IF(N47=0,\"\",INDEX(Risk_Factors!$O$35:$T$36,MATCH('1_Risk_Calc'!N47,Risk_Factors!$E$35:$E$36,0),MATCH($E47,Risk_Factors!$O$8:$T$8,0)))","v":""},{"$f":"IF(O47=0,\"\",INDEX(Risk_Factors!$O$38:$T$39,MATCH('1_Risk_Calc'!O47,Risk_Factors!$E$38:$E$39,0),MATCH($E47,Risk_Factors!$O$8:$T$8,0)))","v":""},{"$f":"IF(P47=0,\"\",INDEX(Risk_Factors!$O$41:$T$42,MATCH('1_Risk_Calc'!P47,Risk_Factors!$E$41:$E$42,0),MATCH($E47,Risk_Factors!$O$8:$T$8,0)))","v":""},0,0,null,null,null,"S_038",0]
[null,"S_039",null,null,null,null,null,null,null,null,null,null,null,null,null,null,{"$f":"IF(F48=0,\"\",INDEX(Risk_Factors!$O$12:$T$14,MATCH(F48,Frequency,0),MATCH($E48,Risk_Factors!$O$8:$T$8,0)))","v":""},{"$f":"IF(G48=0,\"\",INDEX(Risk_Factors!$O$15:$T$17,MATCH('1_Risk_Calc'!G48,Position,0),MATCH($E48,Risk_Factors!$O$8:$T$8,0)))","v":""},{"$f":"IF(H48=0,\"\",INDEX(Risk_Factors!$O$18:$T$19,MATCH('1_Risk_Calc'!H48,Yes_No,0),MATCH($E48,Risk_Factors!$O$8:$T$8,0)))","v":""},{"$f":"IF(I48=0,\"\",INDEX(Risk_Factors!$O$20:$T$22,MATCH('1_Risk_Calc'!I48,Dust_amount,0),MATCH($E48,Risk_Factors!$O$8:$T$8,0)))","v":""},{"$f":"IF(J48=0,\"\",INDEX(Risk_Factors!$O$23:$T$25,MATCH('1_Risk_Calc'!J48,Dust_composition,0),MATCH($E48,Risk_Factors!$O$8:$T$8,0)))","v":""},{"$f":"IF(K48=0,\"\",INDEX(Risk_Factors!$O$26:$T$28,MATCH('1_Risk_Calc'!K48,Dust_size,0),MATCH($E48,Risk_Factors!$O$8:$T$8,0)))","v":""},{"$f":"IF(L48=0,\"\",INDEX(Risk_Factors!$O$29:$T$30,MATCH('1_Risk_Calc'!L48,Risk_Factors!$E$29:$E$30,0),MATCH($E48,Risk_Factors!$O$8:$T$8,0)))","v":""},{"$f":"IF(M48=0,\"\",INDEX(Risk_Factors!$O$32:$T$33,MATCH('1_Risk_Calc'!M48,Risk_Factors!$E$32:$E$33,0),MATCH($E48,Risk_Factors!$O$8:$T$8,0)))","v":""},{"$f":"IF(N48=0,\"\",INDEX(Risk_Factors!$O$35:$T$36,MATCH('1_Risk_Calc'!N48,Risk_Factors!$E$35:$E$36,0),MATCH($E48,Risk_Factors!$O$8:$T$8,0)))","v":""},{"$f":"IF(O48=0,\"\",INDEX(Risk_Factors!$O$38:$T$39,MATCH('1_Risk_Calc'!O48,Risk_Factors!$E$38:$E$39,0),MATCH($E48,Risk_Factors!$O$8:$T$8,0)))","v":""},{"$f":"IF(P48=0,\"\",INDEX(Risk_Factors!$O$41:$T$42,MATCH('1_Risk_Calc'!P48,Risk_Factors!$E$41:$E$42,0),MATCH($E48,Risk_Factors!$O$8:$T$8,0)))","v":""},0,0,null,null,null,"S_039",0]
[null,"S_040",null,null,null,null,null,null,null,null,null,null,null,null,null,null,{"$f":"IF(F49=0,\"\",INDEX(Risk_Factors!$O$12:$T$14,MATCH(F49,Frequency,0),MATCH($E49,Risk_Factors!$O$8:$T$8,0)))","v":""},{"$f":"IF(G49=0,\"\",INDEX(Risk_Factors!$O$15:$T$17,MATCH('1_Risk_Calc'!G49,Position,0),MATCH($E49,Risk_Factors!$O$8:$T$8,0)))","v":""},{"$f":"IF(H49=0,\"\",INDEX(Risk_Factors!$O$18:$T$19,MATCH('1_Risk_Calc'!H49,Yes_No,0),MATCH($E49,Risk_Factors!$O$8:$T$8,0)))","v":""},{"$f":"IF(I49=0,\"\",INDEX(Risk_Factors!$O$20:$T$22,MATCH('1_Risk_Calc'!I49,Dust_amount,0),MATCH($E49,Risk_Factors!$O$8:$T$8,0)))","v":""},{"$f":"IF(J49=0,\"\",INDEX(Risk_Factors!$O$23:$T$25,MATCH('1_Risk_Calc'!J49,Dust_composition,0),MATCH($E49,Risk_Factors!$O$8:$T$8,0)))","v":""},{"$f":"IF(K49=0,\"\",INDEX(Risk_Factors!$O$26:$T$28,MATCH('1_Risk_Calc'!K49,Dust_size,0),MATCH($E49,Risk_Factors!$O$8:$T$8,0)))","v":""},{"$f":"IF(L49=0,\"\",INDEX(Risk_Factors!$O$29:$T$30,MATCH('1_Risk_Calc'!L49,Risk_Factors!$E$29:$E$30,0),MATCH($E49,Risk_Factors!$O$8:$T$8,0)))","v":""},{"$f":"IF(M49=0,\"\",INDEX(Risk_Factors!$O$32:$T$33,MATCH('1_Risk_Calc'!M49,Risk_Factors!$E$32:$E$33,0),MATCH($E49,Risk_Factors!$O$8:$T$8,0)))","v":""},{"$f":"IF(N49=0,\"\",INDEX(Risk_Factors!$O$35:$T$36,MATCH('1_Risk_Calc'!N49,Risk_Factors!$E$35:$E$36,0),MATCH($E49,Risk_Factors!$O$8:$T$8,0)))","v":""},{"$f":"IF(O49=0,\"\",INDEX(Risk_Factors!$O$38:$T$39,MATCH('1_Risk_Calc'!O49,Risk_Factors!$E$38:$E$39,0),MATCH($E49,Risk_Factors!$O$8:$T$8,0)))","v":""},{"$f":"IF(P49=0,\"\",INDEX(Risk_Factors!$O$41:$T$42,MATCH('1_Risk_Calc'!P49,Risk_Factors!$E$41:$E$42,0),MATCH($E49,Risk_Factors!$O$8:$T$8,0)))","v":""},0,0,null,null,null,"S_040",0]
[null,"S_041",null,null,null,null,null,null,null,null,null,null,null,null,null,null,{"$f":"IF(F50=0,\"\",INDEX(Risk_Factors!$O$12:$T$14,MATCH(F50,Frequency,0),MATCH($E50,Risk_Factors!$O$8:$T$8,0)))","v":""},{"$f":"IF(G50=0,\"\",INDEX(Risk_Factors!$O$15:$T$17,MATCH('1_Risk_Calc'!G50,Position,0),MATCH($E50,Risk_Factors!$O$8:$T$8,0)))","v":""},{"$f":"IF(H50=0,\"\",INDEX(Risk_Factors!$O$18:$T$19,MATCH('1_Risk_Calc'!H50,Yes_No,0),MATCH($E50,Risk_Factors!$O$8:$T$8,0)))","v":""},{"$f":"IF(I50=0,\"\",INDEX(Risk_Factors!$O$20:$T$22,MATCH('1_Risk_Calc'!I50,Dust_amount,0),MATCH($E50,Risk_Factors!$O$8:$T$8,0)))","v":""},{"$f":"IF(J50=0,\"\",INDEX(Risk_Factors!$O$23:$T$25,MATCH('1_Risk_Calc'!J50,Dust_composition,0),MATCH($E50,Risk_Factors!$O$8:$T$8,0)))","v":""},{"$f":"IF(K50=0,\"\",INDEX(Risk_Factors!$O$26:$T$28,MATCH('1_Risk_Calc'!K50,Dust_size,0),MATCH($E50,Risk_Factors!$O$8:$T$8,0)))","v":""},{"$f":"IF(L50=0,\"\",INDEX(Risk_Factors!$O$29:$T$30,MATCH('1_Risk_Calc'!L50,Risk_Factors!$E$29:$E$30,0),MATCH($E50,Risk_Factors!$O$8:$T$8,0)))","v":""},{"$f":"IF(M50=0,\"\",INDEX(Risk_Factors!$O$32:$T$33,MATCH('1_Risk_Calc'!M50,Risk_Factors!$E$32:$E$33,0),MATCH($E50,Risk_Factors!$O$8:$T$8,0)))","v":""},{"$f":"IF(N50=0,\"\",INDEX(Risk_Factors!$O$35:$T$36,MATCH('1_Risk_Calc'!N50,Risk_Factors!$E$35:$E$36,0),MATCH($E50,Risk_Factors!$O$8:$T$8,0)))","v":""},{"$f":"IF(O50=0,\"\",INDEX(Risk_Factors!$O$38:$T$39,MATCH('1_Risk_Calc'!O50,Risk_Factors!$E$38:$E$39,0),MATCH($E50,Risk_Factors!$O$8:$T$8,0)))","v":""},{"$f":"IF(P50=0,\"\",INDEX(Risk_Factors!$O$41:$T$42,MATCH('1_Risk_Calc'!P50,Risk_Factors!$E$41:$E$42,0),MATCH($E50,Risk_Factors!$O$8:$T$8,0)))","v":""},0,0,null,null,null,"S_041",0]
[null,"S_042",null,null,null,null,null,null,null,null,null,null,null,null,null,null,{"$f":"IF(F51=0,\"\",INDEX(Risk_Factors!$O$12:$T$14,MATCH(F51,Frequency,0),MATCH($E51,Risk_Factors!$O$8:$T$8,0)))","v":""},{"$f":"IF(G51=0,\"\",INDEX(Risk_Factors!$O$15:$T$17,MATCH('1_Risk_Calc'!G51,Position,0),MATCH($E51,Risk_Factors!$O$8:$T$8,0)))","v":""},{"$f":"IF(H51=0,\"\",INDEX(Risk_Factors!$O$18:$T$19,MATCH('1_Risk_Calc'!H51,Yes_No,0),MATCH($E51,Risk_Factors!$O$8:$T$8,0)))","v":""},{"$f":"IF(I51=0,\"\",INDEX(Risk_Factors!$O$20:$T$22,MATCH('1_Risk_Calc'!I51,Dust_amount,0),MATCH($E51,Risk_Factors!$O$8:$T$8,0)))","v":""},{"$f":"IF(J51=0,\"\",INDEX(Risk_Factors!$O$23:$T$25,MATCH('1_Risk_Calc'!J51,Dust_composition,0),MATCH($E51,Risk_Factors!$O$8:$T$8,0)))","v":""},{"$f":"IF(K51=0,\"\",INDEX(Risk_Factors!$O$26:$T$28,MATCH('1_Risk_Calc'!K51,Dust_size,0),MATCH($E51,Risk_Factors!$O$8:$T$8,0)))","v":""},{"$f":"IF(L51=0,\"\",INDEX(Risk_Factors!$O$29:$T$30,MATCH('1_Risk_Calc'!L51,Risk_Factors!$E$29:$E$30,0),MATCH($E51,Risk_Factors!$O$8:$T$8,0)))","v":""},{"$f":"IF(M51=0,\"\",INDEX(Risk_Factors!$O$32:$T$33,MATCH('1_Risk_Calc'!M51,Risk_Factors!$E$32:$E$33,0),MATCH($E51,Risk_Factors!$O$8:$T$8,0)))","v":""},{"$f":"IF(N51=0,\"\",INDEX(Risk_Factors!$O$35:$T$36,MATCH('1_Risk_Calc'!N51,Risk_Factors!$E$35:$E$36,0),MATCH($E51,Risk_Factors!$O$8:$T$8,0)))","v":""},{"$f":"IF(O51=0,\"\",INDEX(Risk_Factors!$O$38:$T$39,MATCH('1_Risk_Calc'!O51,Risk_Factors!$E$38:$E$39,0),MATCH($E51,Risk_Factors!$O$8:$T$8,0)))","v":""},{"$f":"IF(P51=0,\"\",INDEX(Risk_Factors!$O$41:$T$42,MATCH('1_Risk_Calc'!P51,Risk_Factors!$E$41:$E$42,0),MATCH($E51,Risk_Factors!$O$8:$T$8,0)))","v":""},0,0,null,null,null,"S_042",0]
[null,"S_043",null,null,null,null,null,null,null,null,null,null,null,null,null,null,{"$f":"IF(F52=0,\"\",INDEX(Risk_Factors!$O$12:$T$14,MATCH(F52,Frequency,0),MATCH($E52,Risk_Factors!$O$8:$T$8,0)))","v":""},{"$f":"IF(G52=0,\"\",INDEX(Risk_Factors!$O$15:$T$17,MATCH('1_Risk_Calc'!G52,Position,0),MATCH($E52,Risk_Factors!$O$8:$T$8,0)))","v":""},{"$f":"IF(H52=0,\"\",INDEX(Risk_Factors!$O$18:$T$19,MATCH('1_Risk_Calc'!H52,Yes_No,0),MATCH($E52,Risk_Factors!$O$8:$T$8,0)))","v":""},{"$f":"IF(I52=0,\"\",INDEX(Risk_Factors!$O$20:$T$22,MATCH('1_Risk_Calc'!I52,Dust_amount,0),MATCH($E52,Risk_Factors!$O$8:$T$8,0)))","v":""},{"$f":"IF(J52=0,\"\",INDEX(Risk_Factors!$O$23:$T$25,MATCH('1_Risk_Calc'!J52,Dust_composition,0),MATCH($E52,Risk_Factors!$O$8:$T$8,0)))","v":""},{"$f":"IF(K52=0,\"\",INDEX(Risk_Factors!$O$26:$T$28,MATCH('1_Risk_Calc'!K52,Dust_size,0),MATCH($E52,Risk_Factors!$O$8:$T$8,0)))","v":""},{"$f":"IF(L52=0,\"\",INDEX(Risk_Factors!$O$29:$T$30,MATCH('1_Risk_Calc'!L52,Risk_Factors!$E$29:$E$30,0),MATCH($E52,Risk_Factors!$O$8:$T$8,0)))","v":""},{"$f":"IF(M52=0,\"\",INDEX(Risk_Factors!$O$32:$T$33,MATCH('1_Risk_Calc'!M52,Risk_Factors!$E$32:$E$33,0),MATCH($E52,Risk_Factors!$O$8:$T$8,0)))","v":""},{"$f":"IF(N52=0,\"\",INDEX(Risk_Factors!$O$35:$T$36,MATCH('1_Risk_Calc'!N52,Risk_Factors!$E$35:$E$36,0),MATCH($E52,Risk_Factors!$O$8:$T$8,0)))","v":""},{"$f":"IF(O52=0,\"\",INDEX(Risk_Factors!$O$38:$T$39,MATCH('1_Risk_Calc'!O52,Risk_Factors!$E$38:$E$39,0),MATCH($E52,Risk_Factors!$O$8:$T$8,0)))","v":""},{"$f":"IF(P52=0,\"\",INDEX(Risk_Factors!$O$41:$T$42,MATCH('1_Risk_Calc'!P52,Risk_Factors!$E$41:$E$42,0),MATCH($E52,Risk_Factors!$O$8:$T$8,0)))","v":""},0,0,null,null,null,"S_043",0]
[null,"S_044",null,null,null,null,null,null,null,null,null,null,null,null,null,null,{"$f":"IF(F53=0,\"\",INDEX(Risk_Factors!$O$12:$T$14,MATCH(F53,Frequency,0),MATCH($E53,Risk_Factors!$O$8:$T$8,0)))","v":""},{"$f":"IF(G53=0,\"\",INDEX(Risk_Factors!$O$15:$T$17,MATCH('1_Risk_Calc'!G53,Position,0),MATCH($E53,Risk_Factors!$O$8:$T$8,0)))","v":""},{"$f":"IF(H53=0,\"\",INDEX(Risk_Factors!$O$18:$T$19,MATCH('1_Risk_Calc'!H53,Yes_No,0),MATCH($E53,Risk_Factors!$O$8:$T$8,0)))","v":""},{"$f":"IF(I53=0,\"\",INDEX(Risk_Factors!$O$20:$T$22,MATCH('1_Risk_Calc'!I53,Dust_amount,0),MATCH($E53,Risk_Factors!$O$8:$T$8,0)))","v":""},{"$f":"IF(J53=0,\"\",INDEX(Risk_Factors!$O$23:$T$25,MATCH('1_Risk_Calc'!J53,Dust_composition,0),MATCH($E53,Risk_Factors!$O$8:$T$8,0)))","v":""},{"$f":"IF(K53=0,\"\",INDEX(Risk_Factors!$O$26:$T$28,MATCH('1_Risk_Calc'!K53,Dust_size,0),MATCH($E53,Risk_Factors!$O$8:$T$8,0)))","v":""},{"$f":"IF(L53=0,\"\",INDEX(Risk_Factors!$O$29:$T$30,MATCH('1_Risk_Calc'!L53,Risk_Factors!$E$29:$E$30,0),MATCH($E53,Risk_Factors!$O$8:$T$8,0)))","v":""},{"$f":"IF(M53=0,\"\",INDEX(Risk_Factors!$O$32:$T$33,MATCH('1_Risk_Calc'!M53,Risk_Factors!$E$32:$E$33,0),MATCH($E53,Risk_Factors!$O$8:$T$8,0)))","v":""},{"$f":"IF(N53=0,\"\",INDEX(Risk_Factors!$O$35:$T$36,MATCH('1_Risk_Calc'!N53,Risk_Factors!$E$35:$E$36,0),MATCH($E53,Risk_Factors!$O$8:$T$8,0)))","v":""},{"$f":"IF(O53=0,\"\",INDEX(Risk_Factors!$O$38:$T$39,MATCH('1_Risk_Calc'!O53,Risk_Factors!$E$38:$E$39,0),MATCH($E53,Risk_Factors!$O$8:$T$8,0)))","v":""},{"$f":"IF(P53=0,\"\",INDEX(Risk_Factors!$O$41:$T$42,MATCH('1_Risk_Calc'!P53,Risk_Factors!$E$41:$E$42,0),MATCH($E53,Risk_Factors!$O$8:$T$8,0)))","v":""},0,0,null,null,null,"S_044",0]
[null,"S_045",null,null,null,null,null,null,null,null,null,null,null,null,null,null,{"$f":"IF(F54=0,\"\",INDEX(Risk_Factors!$O$12:$T$14,MATCH(F54,Frequency,0),MATCH($E54,Risk_Factors!$O$8:$T$8,0)))","v":""},{"$f":"IF(G54=0,\"\",INDEX(Risk_Factors!$O$15:$T$17,MATCH('1_Risk_Calc'!G54,Position,0),MATCH($E54,Risk_Factors!$O$8:$T$8,0)))","v":""},{"$f":"IF(H54=0,\"\",INDEX(Risk_Factors!$O$18:$T$19,MATCH('1_Risk_Calc'!H54,Yes_No,0),MATCH($E54,Risk_Factors!$O$8:$T$8,0)))","v":""},{"$f":"IF(I54=0,\"\",INDEX(Risk_Factors!$O$20:$T$22,MATCH('1_Risk_Calc'!I54,Dust_amount,0),MATCH($E54,Risk_Factors!$O$8:$T$8,0)))","v":""},{"$f":"IF(J54=0,\"\",INDEX(Risk_Factors!$O$23:$T$25,MATCH('1_Risk_Calc'!J54,Dust_composition,0),MATCH($E54,Risk_Factors!$O$8:$T$8,0)))","v":""},{"$f":"IF(K54=0,\"\",INDEX(Risk_Factors!$O$26:$T$28,MATCH('1_Risk_Calc'!K54,Dust_size,0),MATCH($E54,Risk_Factors!$O$8:$T$8,0)))","v":""},{"$f":"IF(L54=0,\"\",INDEX(Risk_Factors!$O$29:$T$30,MATCH('1_Risk_Calc'!L54,Risk_Factors!$E$29:$E$30,0),MATCH($E54,Risk_Factors!$O$8:$T$8,0)))","v":""},{"$f":"IF(M54=0,\"\",INDEX(Risk_Factors!$O$32:$T$33,MATCH('1_Risk_Calc'!M54,Risk_Factors!$E$32:$E$33,0),MATCH($E54,Risk_Factors!$O$8:$T$8,0)))","v":""},{"$f":"IF(N54=0,\"\",INDEX(Risk_Factors!$O$35:$T$36,MATCH('1_Risk_Calc'!N54,Risk_Factors!$E$35:$E$36,0),MATCH($E54,Risk_Factors!$O$8:$T$8,0)))","v":""},{"$f":"IF(O54=0,\"\",INDEX(Risk_Factors!$O$38:$T$39,MATCH('1_Risk_Calc'!O54,Risk_Factors!$E$38:$E$39,0),MATCH($E54,Risk_Factors!$O$8:$T$8,0)))","v":""},{"$f":"IF(P54=0,\"\",INDEX(Risk_Factors!$O$41:$T$42,MATCH('1_Risk_Calc'!P54,Risk_Factors!$E$41:$E$42,0),MATCH($E54,Risk_Factors!$O$8:$T$8,0)))","v":""},{"$f":"SUM(Q54:AA54)","v":0},0,null,null,null,"S_045",0]
[null,"S_046",null,null,null,null,null,null,null,null,null,null,null,null,null,null,{"$f":"IF(F55=0,\"\",INDEX(Risk_Factors!$O$12:$T$14,MATCH(F55,Frequency,0),MATCH($E55,Risk_Factors!$O$8:$T$8,0)))","v":""},{"$f":"IF(G55=0,\"\",INDEX(Risk_Factors!$O$15:$T$17,MATCH('1_Risk_Calc'!G55,Position,0),MATCH($E55,Risk_Factors!$O$8:$T$8,0)))","v":""},{"$f":"IF(H55=0,\"\",INDEX(Risk_Factors!$O$18:$T$19,MATCH('1_Risk_Calc'!H55,Yes_No,0),MATCH($E55,Risk_Factors!$O$8:$T$8,0)))","v":""},{"$f":"IF(I55=0,\"\",INDEX(Risk_Factors!$O$20:$T$22,MATCH('1_Risk_Calc'!I55,Dust_amount,0),MATCH($E55,Risk_Factors!$O$8:$T$8,0)))","v":""},{"$f":"IF(J55=0,\"\",INDEX(Risk_Factors!$O$23:$T$25,MATCH('1_Risk_Calc'!J55,Dust_composition,0),MATCH($E55,Risk_Factors!$O$8:$T$8,0)))","v":""},{"$f":"IF(K55=0,\"\",INDEX(Risk_Factors!$O$26:$T$28,MATCH('1_Risk_Calc'!K55,Dust_size,0),MATCH($E55,Risk_Factors!$O$8:$T$8,0)))","v":""},{"$f":"IF(L55=0,\"\",INDEX(Risk_Factors!$O$29:$T$30,MATCH('1_Risk_Calc'!L55,Risk_Factors!$E$29:$E$30,0),MATCH($E55,Risk_Factors!$O$8:$T$8,0)))","v":""},{"$f":"IF(M55=0,\"\",INDEX(Risk_Factors!$O$32:$T$33,MATCH('1_Risk_Calc'!M55,Risk_Factors!$E$32:$E$33,0),MATCH($E55,Risk_Factors!$O$8:$T$8,0)))","v":""},{"$f":"IF(N55=0,\"\",INDEX(Risk_Factors!$O$35:$T$36,MATCH('1_Risk_Calc'!N55,Risk_Factors!$E$35:$E$36,0),MATCH($E55,Risk_Factors!$O$8:$T$8,0)))","v":""},{"$f":"IF(O55=0,\"\",INDEX(Risk_Factors!$O$38:$T$39,MATCH('1_Risk_Calc'!O55,Risk_Factors!$E$38:$E$39,0),MATCH($E55,Risk_Factors!$O$8:$T$8,0)))","v":""},{"$f":"IF(P55=0,\"\",INDEX(Risk_Factors!$O$41:$T$42,MATCH('1_Risk_Calc'!P55,Risk_Factors!$E$41:$E$42,0),MATCH($E55,Risk_Factors!$O$8:$T$8,0)))","v":""},0,0,null,null,null,"S_046",0]
[null,"S_047",null,null,null,null,null,null,null,null,null,null,null,null,null,null,{"$f":"IF(F56=0,\"\",INDEX(Risk_Factors!$O$12:$T$14,MATCH(F56,Frequency,0),MATCH($E56,Risk_Factors!$O$8:$T$8,0)))","v":""},{"$f":"IF(G56=0,\"\",INDEX(Risk_Factors!$O$15:$T$17,MATCH('1_Risk_Calc'!G56,Position,0),MATCH($E56,Risk_Factors!$O$8:$T$8,0)))","v":""},{"$f":"IF(H56=0,\"\",INDEX(Risk_Factors!$O$18:$T$19,MATCH('1_Risk_Calc'!H56,Yes_No,0),MATCH($E56,Risk_Factors!$O$8:$T$8,0)))","v":""},{"$f":"IF(I56=0,\"\",INDEX(Risk_Factors!$O$20:$T$22,MATCH('1_Risk_Calc'!I56,Dust_amount,0),MATCH($E56,Risk_Factors!$O$8:$T$8,0)))","v":""},{"$f":"IF(J56=0,\"\",INDEX(Risk_Factors!$O$23:$T$25,MATCH('1_Risk_Calc'!J56,Dust_composition,0),MATCH($E56,Risk_Factors!$O$8:$T$8,0)))","v":""},{"$f":"IF(K56=0,\"\",INDEX(Risk_Factors!$O$26:$T$28,MATCH('1_Risk_Calc'!K56,Dust_size,0),MATCH($E56,Risk_Factors!$O$8:$T$8,0)))","v":""},{"$f":"IF(L56=0,\"\",INDEX(Risk_Factors!$O$29:$T$30,MATCH('1_Risk_Calc'!L56,Risk_Factors!$E$29:$E$30,0),MATCH($E56,Risk_Factors!$O$8:$T$8,0)))","v":""},{"$f":"IF(M56=0,\"\",INDEX(Risk_Factors!$O$32:$T$33,MATCH('1_Risk_Calc'!M56,Risk_Factors!$E$32:$E$33,0),MATCH($E56,Risk_Factors!$O$8:$T$8,0)))","v":""},{"$f":"IF(N56=0,\"\",INDEX(Risk_Factors!$O$35:$T$36,MATCH('1_Risk_Calc'!N56,Risk_Factors!$E$35:$E$36,0),MATCH($E56,Risk_Factors!$O$8:$T$8,0)))","v":""},{"$f":"IF(O56=0,\"\",INDEX(Risk_Factors!$O$38:$T$39,MATCH('1_Risk_Calc'!O56,Risk_Factors!$E$38:$E$39,0),MATCH($E56,Risk_Factors!$O$8:$T$8,0)))","v":""},{"$f":"IF(P56=0,\"\",INDEX(Risk_Factors!$O$41:$T$42,MATCH('1_Risk_Calc'!P56,Risk_Factors!$E$41:$E$42,0),MATCH($E56,Risk_Factors!$O$8:$T$8,0)))","v":""},0,0,null,null,null,"S_047",0]
[null,"S_048",null,null,null,null,null,null,null,null,null,null,null,null,null,null,{"$f":"IF(F57=0,\"\",INDEX(Risk_Factors!$O$12:$T$14,MATCH(F57,Frequency,0),MATCH($E57,Risk_Factors!$O$8:$T$8,0)))","v":""},{"$f":"IF(G57=0,\"\",INDEX(Risk_Factors!$O$15:$T$17,MATCH('1_Risk_Calc'!G57,Position,0),MATCH($E57,Risk_Factors!$O$8:$T$8,0)))","v":""},{"$f":"IF(H57=0,\"\",INDEX(Risk_Factors!$O$18:$T$19,MATCH('1_Risk_Calc'!H57,Yes_No,0),MATCH($E57,Risk_Factors!$O$8:$T$8,0)))","v":""},{"$f":"IF(I57=0,\"\",INDEX(Risk_Factors!$O$20:$T$22,MATCH('1_Risk_Calc'!I57,Dust_amount,0),MATCH($E57,Risk_Factors!$O$8:$T$8,0)))","v":""},{"$f":"IF(J57=0,\"\",INDEX(Risk_Factors!$O$23:$T$25,MATCH('1_Risk_Calc'!J57,Dust_composition,0),MATCH($E57,Risk_Factors!$O$8:$T$8,0)))","v":""},{"$f":"IF(K57=0,\"\",INDEX(Risk_Factors!$O$26:$T$28,MATCH('1_Risk_Calc'!K57,Dust_size,0),MATCH($E57,Risk_Factors!$O$8:$T$8,0)))","v":""},{"$f":"IF(L57=0,\"\",INDEX(Risk_Factors!$O$29:$T$30,MATCH('1_Risk_Calc'!L57,Risk_Factors!$E$29:$E$30,0),MATCH($E57,Risk_Factors!$O$8:$T$8,0)))","v":""},{"$f":"IF(M57=0,\"\",INDEX(Risk_Factors!$O$32:$T$33,MATCH('1_Risk_Calc'!M57,Risk_Factors!$E$32:$E$33,0),MATCH($E57,Risk_Factors!$O$8:$T$8,0)))","v":""},{"$f":"IF(N57=0,\"\",INDEX(Risk_Factors!$O$35:$T$36,MATCH('1_Risk_Calc'!N57,Risk_Factors!$E$35:$E$36,0),MATCH($E57,Risk_Factors!$O$8:$T$8,0)))","v":""},{"$f":"IF(O57=0,\"\",INDEX(Risk_Factors!$O$38:$T$39,MATCH('1_Risk_Calc'!O57,Risk_Factors!$E$38:$E$39,0),MATCH($E57,Risk_Factors!$O$8:$T$8,0)))","v":""},{"$f":"IF(P57=0,\"\",INDEX(Risk_Factors!$O$41:$T$42,MATCH('1_Risk_Calc'!P57,Risk_Factors!$E$41:$E$42,0),MATCH($E57,Risk_Factors!$O$8:$T$8,0)))","v":""},0,0,null,null,null,"S_048",0]
[null,"S_049",null,null,null,null,null,null,null,null,null,null,null,null,null,null,{"$f":"IF(F58=0,\"\",INDEX(Risk_Factors!$O$12:$T$14,MATCH(F58,Frequency,0),MATCH($E58,Risk_Factors!$O$8:$T$8,0)))","v":""},{"$f":"IF(G58=0,\"\",INDEX(Risk_Factors!$O$15:$T$17,MATCH('1_Risk_Calc'!G58,Position,0),MATCH($E58,Risk_Factors!$O$8:$T$8,0)))","v":""},{"$f":"IF(H58=0,\"\",INDEX(Risk_Factors!$O$18:$T$19,MATCH('1_Risk_Calc'!H58,Yes_No,0),MATCH($E58,Risk_Factors!$O$8:$T$8,0)))","v":""},{"$f":"IF(I58=0,\"\",INDEX(Risk_Factors!$O$20:$T$22,MATCH('1_Risk_Calc'!I58,Dust_amount,0),MATCH($E58,Risk_Factors!$O$8:$T$8,0)))","v":""},{"$f":"IF(J58=0,\"\",INDEX(Risk_Factors!$O$23:$T$25,MATCH('1_Risk_Calc'!J58,Dust_composition,0),MATCH($E58,Risk_Factors!$O$8:$T$8,0)))","v":""},{"$f":"IF(K58=0,\"\",INDEX(Risk_Factors!$O$26:$T$28,MATCH('1_Risk_Calc'!K58,Dust_size,0),MATCH($E58,Risk_Factors!$O$8:$T$8,0)))","v":""},{"$f":"IF(L58=0,\"\",INDEX(Risk_Factors!$O$29:$T$30,MATCH('1_Risk_Calc'!L58,Risk_Factors!$E$29:$E$30,0),MATCH($E58,Risk_Factors!$O$8:$T$8,0)))","v":""},{"$f":"IF(M58=0,\"\",INDEX(Risk_Factors!$O$32:$T$33,MATCH('1_Risk_Calc'!M58,Risk_Factors!$E$32:$E$33,0),MATCH($E58,Risk_Factors!$O$8:$T$8,0)))","v":""},{"$f":"IF(N58=0,\"\",INDEX(Risk_Factors!$O$35:$T$36,MATCH('1_Risk_Calc'!N58,Risk_Factors!$E$35:$E$36,0),MATCH($E58,Risk_Factors!$O$8:$T$8,0)))","v":""},{"$f":"IF(O58=0,\"\",INDEX(Risk_Factors!$O$38:$T$39,MATCH('1_Risk_Calc'!O58,Risk_Factors!$E$38:$E$39,0),MATCH($E58,Risk_Factors!$O$8:$T$8,0)))","v":""},{"$f":"IF(P58=0,\"\",INDEX(Risk_Factors!$O$41:$T$42,MATCH('1_Risk_Calc'!P58,Risk_Factors!$E$41:$E$42,0),MATCH($E58,Risk_Factors!$O$8:$T$8,0)))","v":""},0,0,null,null,null,"S_049",0]
[null,"S_050",null,null,null,null,null,null,null,null,null,null,null,null,null,null,{"$f":"IF(F59=0,\"\",INDEX(Risk_Factors!$O$12:$T$14,MATCH(F59,Frequency,0),MATCH($E59,Risk_Factors!$O$8:$T$8,0)))","v":""},{"$f":"IF(G59=0,\"\",INDEX(Risk_Factors!$O$15:$T$17,MATCH('1_Risk_Calc'!G59,Position,0),MATCH($E59,Risk_Factors!$O$8:$T$8,0)))","v":""},{"$f":"IF(H59=0,\"\",INDEX(Risk_Factors!$O$18:$T$19,MATCH('1_Risk_Calc'!H59,Yes_No,0),MATCH($E59,Risk_Factors!$O$8:$T$8,0)))","v":""},{"$f":"IF(I59=0,\"\",INDEX(Risk_Factors!$O$20:$T$22,MATCH('1_Risk_Calc'!I59,Dust_amount,0),MATCH($E59,Risk_Factors!$O$8:$T$8,0)))","v":""},{"$f":"IF(J59=0,\"\",INDEX(Risk_Factors!$O$23:$T$25,MATCH('1_Risk_Calc'!J59,Dust_composition,0),MATCH($E59,Risk_Factors!$O$8:$T$8,0)))","v":""},{"$f":"IF(K59=0,\"\",INDEX(Risk_Factors!$O$26:$T$28,MATCH('1_Risk_Calc'!K59,Dust_size,0),MATCH($E59,Risk_Factors!$O$8:$T$8,0)))","v":""},{"$f":"IF(L59=0,\"\",INDEX(Risk_Factors!$O$29:$T$30,MATCH('1_Risk_Calc'!L59,Risk_Factors!$E$29:$E$30,0),MATCH($E59,Risk_Factors!$O$8:$T$8,0)))","v":""},{"$f":"IF(M59=0,\"\",INDEX(Risk_Factors!$O$32:$T$33,MATCH('1_Risk_Calc'!M59,Risk_Factors!$E$32:$E$33,0),MATCH($E59,Risk_Factors!$O$8:$T$8,0)))","v":""},{"$f":"IF(N59=0,\"\",INDEX(Risk_Factors!$O$35:$T$36,MATCH('1_Risk_Calc'!N59,Risk_Factors!$E$35:$E$36,0),MATCH($E59,Risk_Factors!$O$8:$T$8,0)))","v":""},{"$f":"IF(O59=0,\"\",INDEX(Risk_Factors!$O$38:$T$39,MATCH('1_Risk_Calc'!O59,Risk_Factors!$E$38:$E$39,0),MATCH($E59,Risk_Factors!$O$8:$T$8,0)))","v":""},{"$f":"IF(P59=0,\"\",INDEX(Risk_Factors!$O$41:$T$42,MATCH('1_Risk_Calc'!P59,Risk_Factors!$E$41:$E$42,0),MATCH($E59,Risk_Factors!$O$8:$T$8,0)))","v":""},0,0,null,null,null,"S_050",0]
[null,"S_051",null,null,null,null,null,null,null,null,null,null,null,null,null,null,{"$f":"IF(F60=0,\"\",INDEX(Risk_Factors!$O$12:$T$14,MATCH(F60,Frequency,0),MATCH($E60,Risk_Factors!$O$8:$T$8,0)))","v":""},{"$f":"IF(G60=0,\"\",INDEX(Risk_Factors!$O$15:$T$17,MATCH('1_Risk_Calc'!G60,Position,0),MATCH($E60,Risk_Factors!$O$8:$T$8,0)))","v":""},{"$f":"IF(H60=0,\"\",INDEX(Risk_Factors!$O$18:$T$19,MATCH('1_Risk_Calc'!H60,Yes_No,0),MATCH($E60,Risk_Factors!$O$8:$T$8,0)))","v":""},{"$f":"IF(I60=0,\"\",INDEX(Risk_Factors!$O$20:$T$22,MATCH('1_Risk_Calc'!I60,Dust_amount,0),MATCH($E60,Risk_Factors!$O$8:$T$8,0)))","v":""},{"$f":"IF(J60=0,\"\",INDEX(Risk_Factors!$O$23:$T$25,MATCH('1_Risk_Calc'!J60,Dust_composition,0),MATCH($E60,Risk_Factors!$O$8:$T$8,0)))","v":""},{"$f":"IF(K60=0,\"\",INDEX(Risk_Factors!$O$26:$T$28,MATCH('1_Risk_Calc'!K60,Dust_size,0),MATCH($E60,Risk_Factors!$O$8:$T$8,0)))","v":""},{"$f":"IF(L60=0,\"\",INDEX(Risk_Factors!$O$29:$T$30,MATCH('1_Risk_Calc'!L60,Risk_Factors!$E$29:$E$30,0),MATCH($E60,Risk_Factors!$O$8:$T$8,0)))","v":""},{"$f":"IF(M60=0,\"\",INDEX(Risk_Factors!$O$32:$T$33,MATCH('1_Risk_Calc'!M60,Risk_Factors!$E$32:$E$33,0),MATCH($E60,Risk_Factors!$O$8:$T$8,0)))","v":""},{"$f":"IF(N60=0,\"\",INDEX(Risk_Factors!$O$35:$T$36,MATCH('1_Risk_Calc'!N60,Risk_Factors!$E$35:$E$36,0),MATCH($E60,Risk_Factors!$O$8:$T$8,0)))","v":""},{"$f":"IF(O60=0,\"\",INDEX(Risk_Factors!$O$38:$T$39,MATCH('1_Risk_Calc'!O60,Risk_Factors!$E$38:$E$39,0),MATCH($E60,Risk_Factors!$O$8:$T$8,0)))","v":""},{"$f":"IF(P60=0,\"\",INDEX(Risk_Factors!$O$41:$T$42,MATCH('1_Risk_Calc'!P60,Risk_Factors!$E$41:$E$42,0),MATCH($E60,Risk_Factors!$O$8:$T$8,0)))","v":""},0,0,null,null,null,"S_051",0]
[null,"S_052",null,null,null,null,null,null,null,null,null,null,null,null,null,null,{"$f":"IF(F61=0,\"\",INDEX(Risk_Factors!$O$12:$T$14,MATCH(F61,Frequency,0),MATCH($E61,Risk_Factors!$O$8:$T$8,0)))","v":""},{"$f":"IF(G61=0,\"\",INDEX(Risk_Factors!$O$15:$T$17,MATCH('1_Risk_Calc'!G61,Position,0),MATCH($E61,Risk_Factors!$O$8:$T$8,0)))","v":""},{"$f":"IF(H61=0,\"\",INDEX(Risk_Factors!$O$18:$T$19,MATCH('1_Risk_Calc'!H61,Yes_No,0),MATCH($E61,Risk_Factors!$O$8:$T$8,0)))","v":""},{"$f":"IF(I61=0,\"\",INDEX(Risk_Factors!$O$20:$T$22,MATCH('1_Risk_Calc'!I61,Dust_amount,0),MATCH($E61,Risk_Factors!$O$8:$T$8,0)))","v":""},{"$f":"IF(J61=0,\"\",INDEX(Risk_Factors!$O$23:$T$25,MATCH('1_Risk_Calc'!J61,Dust_composition,0),MATCH($E61,Risk_Factors!$O$8:$T$8,0)))","v":""},{"$f":"IF(K61=0,\"\",INDEX(Risk_Factors!$O$26:$T$28,MATCH('1_Risk_Calc'!K61,Dust_size,0),MATCH($E61,Risk_Factors!$O$8:$T$8,0)))","v":""},{"$f":"IF(L61=0,\"\",INDEX(Risk_Factors!$O$29:$T$30,MATCH('1_Risk_Calc'!L61,Risk_Factors!$E$29:$E$30,0),MATCH($E61,Risk_Factors!$O$8:$T$8,0)))","v":""},{"$f":"IF(M61=0,\"\",INDEX(Risk_Factors!$O$32:$T$33,MATCH('1_Risk_Calc'!M61,Risk_Factors!$E$32:$E$33,0),MATCH($E61,Risk_Factors!$O$8:$T$8,0)))","v":""},{"$f":"IF(N61=0,\"\",INDEX(Risk_Factors!$O$35:$T$36,MATCH('1_Risk_Calc'!N61,Risk_Factors!$E$35:$E$36,0),MATCH($E61,Risk_Factors!$O$8:$T$8,0)))","v":""},{"$f":"IF(O61=0,\"\",INDEX(Risk_Factors!$O$38:$T$39,MATCH('1_Risk_Calc'!O61,Risk_Factors!$E$38:$E$39,0),MATCH($E61,Risk_Factors!$O$8:$T$8,0)))","v":""},{"$f":"IF(P61=0,\"\",INDEX(Risk_Factors!$O$41:$T$42,MATCH('1_Risk_Calc'!P61,Risk_Factors!$E$41:$E$42,0),MATCH($E61,Risk_Factors!$O$8:$T$8,0)))","v":""},0,0,null,null,null,"S_052",0]
[null,"S_053",null,null,null,null,null,null,null,null,null,null,null,null,null,null,{"$f":"IF(F62=0,\"\",INDEX(Risk_Factors!$O$12:$T$14,MATCH(F62,Frequency,0),MATCH($E62,Risk_Factors!$O$8:$T$8,0)))","v":""},{"$f":"IF(G62=0,\"\",INDEX(Risk_Factors!$O$15:$T$17,MATCH('1_Risk_Calc'!G62,Position,0),MATCH($E62,Risk_Factors!$O$8:$T$8,0)))","v":""},{"$f":"IF(H62=0,\"\",INDEX(Risk_Factors!$O$18:$T$19,MATCH('1_Risk_Calc'!H62,Yes_No,0),MATCH($E62,Risk_Factors!$O$8:$T$8,0)))","v":""},{"$f":"IF(I62=0,\"\",INDEX(Risk_Factors!$O$20:$T$22,MATCH('1_Risk_Calc'!I62,Dust_amount,0),MATCH($E62,Risk_Factors!$O$8:$T$8,0)))","v":""},{"$f":"IF(J62=0,\"\",INDEX(Risk_Factors!$O$23:$T$25,MATCH('1_Risk_Calc'!J62,Dust_composition,0),MATCH($E62,Risk_Factors!$O$8:$T$8,0)))","v":""},{"$f":"IF(K62=0,\"\",INDEX(Risk_Factors!$O$26:$T$28,MATCH('1_Risk_Calc'!K62,Dust_size,0),MATCH($E62,Risk_Factors!$O$8:$T$8,0)))","v":""},{"$f":"IF(L62=0,\"\",INDEX(Risk_Factors!$O$29:$T$30,MATCH('1_Risk_Calc'!L62,Risk_Factors!$E$29:$E$30,0),MATCH($E62,Risk_Factors!$O$8:$T$8,0)))","v":""},{"$f":"IF(M62=0,\"\",INDEX(Risk_Factors!$O$32:$T$33,MATCH('1_Risk_Calc'!M62,Risk_Factors!$E$32:$E$33,0),MATCH($E62,Risk_Factors!$O$8:$T$8,0)))","v":""},{"$f":"IF(N62=0,\"\",INDEX(Risk_Factors!$O$35:$T$36,MATCH('1_Risk_Calc'!N62,Risk_Factors!$E$35:$E$36,0),MATCH($E62,Risk_Factors!$O$8:$T$8,0)))","v":""},{"$f":"IF(O62=0,\"\",INDEX(Risk_Factors!$O$38:$T$39,MATCH('1_Risk_Calc'!O62,Risk_Factors!$E$38:$E$39,0),MATCH($E62,Risk_Factors!$O$8:$T$8,0)))","v":""},{"$f":"IF(P62=0,\"\",INDEX(Risk_Factors!$O$41:$T$42,MATCH('1_Risk_Calc'!P62,Risk_Factors!$E$41:$E$42,0),MATCH($E62,Risk_Factors!$O$8:$T$8,0)))","v":""},0,0,null,null,null,"S_053",0]
[null,"S_054",null,null,null,null,null,null,null,null,null,null,null,null,null,null,{"$f":"IF(F63=0,\"\",INDEX(Risk_Factors!$O$12:$T$14,MATCH(F63,Frequency,0),MATCH($E63,Risk_Factors!$O$8:$T$8,0)))","v":""},{"$f":"IF(G63=0,\"\",INDEX(Risk_Factors!$O$15:$T$17,MATCH('1_Risk_Calc'!G63,Position,0),MATCH($E63,Risk_Factors!$O$8:$T$8,0)))","v":""},{"$f":"IF(H63=0,\"\",INDEX(Risk_Factors!$O$18:$T$19,MATCH('1_Risk_Calc'!H63,Yes_No,0),MATCH($E63,Risk_Factors!$O$8:$T$8,0)))","v":""},{"$f":"IF(I63=0,\"\",INDEX(Risk_Factors!$O$20:$T$22,MATCH('1_Risk_Calc'!I63,Dust_amount,0),MATCH($E63,Risk_Factors!$O$8:$T$8,0)))","v":""},{"$f":"IF(J63=0,\"\",INDEX(Risk_Factors!$O$23:$T$25,MATCH('1_Risk_Calc'!J63,Dust_composition,0),MATCH($E63,Risk_Factors!$O$8:$T$8,0)))","v":""},{"$f":"IF(K63=0,\"\",INDEX(Risk_Factors!$O$26:$T$28,MATCH('1_Risk_Calc'!K63,Dust_size,0),MATCH($E63,Risk_Factors!$O$8:$T$8,0)))","v":""},{"$f":"IF(L63=0,\"\",INDEX(Risk_Factors!$O$29:$T$30,MATCH('1_Risk_Calc'!L63,Risk_Factors!$E$29:$E$30,0),MATCH($E63,Risk_Factors!$O$8:$T$8,0)))","v":""},{"$f":"IF(M63=0,\"\",INDEX(Risk_Factors!$O$32:$T$33,MATCH('1_Risk_Calc'!M63,Risk_Factors!$E$32:$E$33,0),MATCH($E63,Risk_Factors!$O$8:$T$8,0)))","v":""},{"$f":"IF(N63=0,\"\",INDEX(Risk_Factors!$O$35:$T$36,MATCH('1_Risk_Calc'!N63,Risk_Factors!$E$35:$E$36,0),MATCH($E63,Risk_Factors!$O$8:$T$8,0)))","v":""},{"$f":"IF(O63=0,\"\",INDEX(Risk_Factors!$O$38:$T$39,MATCH('1_Risk_Calc'!O63,Risk_Factors!$E$38:$E$39,0),MATCH($E63,Risk_Factors!$O$8:$T$8,0)))","v":""},{"$f":"IF(P63=0,\"\",INDEX(Risk_Factors!$O$41:$T$42,MATCH('1_Risk_Calc'!P63,Risk_Factors!$E$41:$E$42,0),MATCH($E63,Risk_Factors!$O$8:$T$8,0)))","v":""},0,0,null,null,null,"S_054",0]
[null,"S_055",null,null,null,null,null,null,null,null,null,null,null,null,null,null,{"$f":"IF(F64=0,\"\",INDEX(Risk_Factors!$O$12:$T$14,MATCH(F64,Frequency,0),MATCH($E64,Risk_Factors!$O$8:$T$8,0)))","v":""},{"$f":"IF(G64=0,\"\",INDEX(Risk_Factors!$O$15:$T$17,MATCH('1_Risk_Calc'!G64,Position,0),MATCH($E64,Risk_Factors!$O$8:$T$8,0)))","v":""},{"$f":"IF(H64=0,\"\",INDEX(Risk_Factors!$O$18:$T$19,MATCH('1_Risk_Calc'!H64,Yes_No,0),MATCH($E64,Risk_Factors!$O$8:$T$8,0)))","v":""},{"$f":"IF(I64=0,\"\",INDEX(Risk_Factors!$O$20:$T$22,MATCH('1_Risk_Calc'!I64,Dust_amount,0),MATCH($E64,Risk_Factors!$O$8:$T$8,0)))","v":""},{"$f":"IF(J64=0,\"\",INDEX(Risk_Factors!$O$23:$T$25,MATCH('1_Risk_Calc'!J64,Dust_composition,0),MATCH($E64,Risk_Factors!$O$8:$T$8,0)))","v":""},{"$f":"IF(K64=0,\"\",INDEX(Risk_Factors!$O$26:$T$28,MATCH('1_Risk_Calc'!K64,Dust_size,0),MATCH($E64,Risk_Factors!$O$8:$T$8,0)))","v":""},{"$f":"IF(L64=0,\"\",INDEX(Risk_Factors!$O$29:$T$30,MATCH('1_Risk_Calc'!L64,Risk_Factors!$E$29:$E$30,0),MATCH($E64,Risk_Factors!$O$8:$T$8,0)))","v":""},{"$f":"IF(M64=0,\"\",INDEX(Risk_Factors!$O$32:$T$33,MATCH('1_Risk_Calc'!M64,Risk_Factors!$E$32:$E$33,0),MATCH($E64,Risk_Factors!$O$8:$T$8,0)))","v":""},{"$f":"IF(N64=0,\"\",INDEX(Risk_Factors!$O$35:$T$36,MATCH('1_Risk_Calc'!N64,Risk_Factors!$E$35:$E$36,0),MATCH($E64,Risk_Factors!$O$8:$T$8,0)))","v":""},{"$f":"IF(O64=0,\"\",INDEX(Risk_Factors!$O$38:$T$39,MATCH('1_Risk_Calc'!O64,Risk_Factors!$E$38:$E$39,0),MATCH($E64,Risk_Factors!$O$8:$T$8,0)))","v":""},{"$f":"IF(P64=0,\"\",INDEX(Risk_Factors!$O$41:$T$42,MATCH('1_Risk_Calc'!P64,Risk_Factors!$E$41:$E$42,0),MATCH($E64,Risk_Factors!$O$8:$T$8,0)))","v":""},0,0,null,null,null,"S_055",0]
[null,"S_056",null,null,null,null,null,null,null,null,null,null,null,null,null,null,{"$f":"IF(F65=0,\"\",INDEX(Risk_Factors!$O$12:$T$14,MATCH(F65,Frequency,0),MATCH($E65,Risk_Factors!$O$8:$T$8,0)))","v":""},{"$f":"IF(G65=0,\"\",INDEX(Risk_Factors!$O$15:$T$17,MATCH('1_Risk_Calc'!G65,Position,0),MATCH($E65,Risk_Factors!$O$8:$T$8,0)))","v":""},{"$f":"IF(H65=0,\"\",INDEX(Risk_Factors!$O$18:$T$19,MATCH('1_Risk_Calc'!H65,Yes_No,0),MATCH($E65,Risk_Factors!$O$8:$T$8,0)))","v":""},{"$f":"IF(I65=0,\"\",INDEX(Risk_Factors!$O$20:$T$22,MATCH('1_Risk_Calc'!I65,Dust_amount,0),MATCH($E65,Risk_Factors!$O$8:$T$8,0)))","v":""},{"$f":"IF(J65=0,\"\",INDEX(Risk_Factors!$O$23:$T$25,MATCH('1_Risk_Calc'!J65,Dust_composition,0),MATCH($E65,Risk_Factors!$O$8:$T$8,0)))","v":""},{"$f":"IF(K65=0,\"\",INDEX(Risk_Factors!$O$26:$T$28,MATCH('1_Risk_Calc'!K65,Dust_size,0),MATCH($E65,Risk_Factors!$O$8:$T$8,0)))","v":""},{"$f":"IF(L65=0,\"\",INDEX(Risk_Factors!$O$29:$T$30,MATCH('1_Risk_Calc'!L65,Risk_Factors!$E$29:$E$30,0),MATCH($E65,Risk_Factors!$O$8:$T$8,0)))","v":""},{"$f":"IF(M65=0,\"\",INDEX(Risk_Factors!$O$32:$T$33,MATCH('1_Risk_Calc'!M65,Risk_Factors!$E$32:$E$33,0),MATCH($E65,Risk_Factors!$O$8:$T$8,0)))","v":""},{"$f":"IF(N65=0,\"\",INDEX(Risk_Factors!$O$35:$T$36,MATCH('1_Risk_Calc'!N65,Risk_Factors!$E$35:$E$36,0),MATCH($E65,Risk_Factors!$O$8:$T$8,0)))","v":""},{"$f":"IF(O65=0,\"\",INDEX(Risk_Factors!$O$38:$T$39,MATCH('1_Risk_Calc'!O65,Risk_Factors!$E$38:$E$39,0),MATCH($E65,Risk_Factors!$O$8:$T$8,0)))","v":""},{"$f":"IF(P65=0,\"\",INDEX(Risk_Factors!$O$41:$T$42,MATCH('1_Risk_Calc'!P65,Risk_Factors!$E$41:$E$42,0),MATCH($E65,Risk_Factors!$O$8:$T$8,0)))","v":""},0,0,null,null,null,"S_056",0]
[null,"S_057",null,null,null,null,null,null,null,null,null,null,null,null,null,null,{"$f":"IF(F66=0,\"\",INDEX(Risk_Factors!$O$12:$T$14,MATCH(F66,Frequency,0),MATCH($E66,Risk_Factors!$O$8:$T$8,0)))","v":""},{"$f":"IF(G66=0,\"\",INDEX(Risk_Factors!$O$15:$T$17,MATCH('1_Risk_Calc'!G66,Position,0),MATCH($E66,Risk_Factors!$O$8:$T$8,0)))","v":""},{"$f":"IF(H66=0,\"\",INDEX(Risk_Factors!$O$18:$T$19,MATCH('1_Risk_Calc'!H66,Yes_No,0),MATCH($E66,Risk_Factors!$O$8:$T$8,0)))","v":""},{"$f":"IF(I66=0,\"\",INDEX(Risk_Factors!$O$20:$T$22,MATCH('1_Risk_Calc'!I66,Dust_amount,0),MATCH($E66,Risk_Factors!$O$8:$T$8,0)))","v":""},{"$f":"IF(J66=0,\"\",INDEX(Risk_Factors!$O$23:$T$25,MATCH('1_Risk_Calc'!J66,Dust_composition,0),MATCH($E66,Risk_Factors!$O$8:$T$8,0)))","v":""},{"$f":"IF(K66=0,\"\",INDEX(Risk_Factors!$O$26:$T$28,MATCH('1_Risk_Calc'!K66,Dust_size,0),MATCH($E66,Risk_Factors!$O$8:$T$8,0)))","v":""},{"$f":"IF(L66=0,\"\",INDEX(Risk_Factors!$O$29:$T$30,MATCH('1_Risk_Calc'!L66,Risk_Factors!$E$29:$E$30,0),MATCH($E66,Risk_Factors!$O$8:$T$8,0)))","v":""},{"$f":"IF(M66=0,\"\",INDEX(Risk_Factors!$O$32:$T$33,MATCH('1_Risk_Calc'!M66,Risk_Factors!$E$32:$E$33,0),MATCH($E66,Risk_Factors!$O$8:$T$8,0)))","v":""},{"$f":"IF(N66=0,\"\",INDEX(Risk_Factors!$O$35:$T$36,MATCH('1_Risk_Calc'!N66,Risk_Factors!$E$35:$E$36,0),MATCH($E66,Risk_Factors!$O$8:$T$8,0)))","v":""},{"$f":"IF(O66=0,\"\",INDEX(Risk_Factors!$O$38:$T$39,MATCH('1_Risk_Calc'!O66,Risk_Factors!$E$38:$E$39,0),MATCH($E66,Risk_Factors!$O$8:$T$8,0)))","v":""},{"$f":"IF(P66=0,\"\",INDEX(Risk_Factors!$O$41:$T$42,MATCH('1_Risk_Calc'!P66,Risk_Factors!$E$41:$E$42,0),MATCH($E66,Risk_Factors!$O$8:$T$8,0)))","v":""},0,0,null,null,null,"S_057",0]
[null,"S_058",null,null,null,null,null,null,null,null,null,null,null,null,null,null,{"$f":"IF(F67=0,\"\",INDEX(Risk_Factors!$O$12:$T$14,MATCH(F67,Frequency,0),MATCH($E67,Risk_Factors!$O$8:$T$8,0)))","v":""},{"$f":"IF(G67=0,\"\",INDEX(Risk_Factors!$O$15:$T$17,MATCH('1_Risk_Calc'!G67,Position,0),MATCH($E67,Risk_Factors!$O$8:$T$8,0)))","v":""},{"$f":"IF(H67=0,\"\",INDEX(Risk_Factors!$O$18:$T$19,MATCH('1_Risk_Calc'!H67,Yes_No,0),MATCH($E67,Risk_Factors!$O$8:$T$8,0)))","v":""},{"$f":"IF(I67=0,\"\",INDEX(Risk_Factors!$O$20:$T$22,MATCH('1_Risk_Calc'!I67,Dust_amount,0),MATCH($E67,Risk_Factors!$O$8:$T$8,0)))","v":""},{"$f":"IF(J67=0,\"\",INDEX(Risk_Factors!$O$23:$T$25,MATCH('1_Risk_Calc'!J67,Dust_composition,0),MATCH($E67,Risk_Factors!$O$8:$T$8,0)))","v":""},{"$f":"IF(K67=0,\"\",INDEX(Risk_Factors!$O$26:$T$28,MATCH('1_Risk_Calc'!K67,Dust_size,0),MATCH($E67,Risk_Factors!$O$8:$T$8,0)))","v":""},{"$f":"IF(L67=0,\"\",INDEX(Risk_Factors!$O$29:$T$30,MATCH('1_Risk_Calc'!L67,Risk_Factors!$E$29:$E$30,0),MATCH($E67,Risk_Factors!$O$8:$T$8,0)))","v":""},{"$f":"IF(M67=0,\"\",INDEX(Risk_Factors!$O$32:$T$33,MATCH('1_Risk_Calc'!M67,Risk_Factors!$E$32:$E$33,0),MATCH($E67,Risk_Factors!$O$8:$T$8,0)))","v":""},{"$f":"IF(N67=0,\"\",INDEX(Risk_Factors!$O$35:$T$36,MATCH('1_Risk_Calc'!N67,Risk_Factors!$E$35:$E$36,0),MATCH($E67,Risk_Factors!$O$8:$T$8,0)))","v":""},{"$f":"IF(O67=0,\"\",INDEX(Risk_Factors!$O$38:$T$39,MATCH('1_Risk_Calc'!O67,Risk_Factors!$E$38:$E$39,0),MATCH($E67,Risk_Factors!$O$8:$T$8,0)))","v":""},{"$f":"IF(P67=0,\"\",INDEX(Risk_Factors!$O$41:$T$42,MATCH('1_Risk_Calc'!P67,Risk_Factors!$E$41:$E$42,0),MATCH($E67,Risk_Factors!$O$8:$T$8,0)))","v":""},0,0,null,null,null,"S_058",0]
[null,"S_059",null,null,null,null,null,null,null,null,null,null,null,null,null,null,{"$f":"IF(F68=0,\"\",INDEX(Risk_Factors!$O$12:$T$14,MATCH(F68,Frequency,0),MATCH($E68,Risk_Factors!$O$8:$T$8,0)))","v":""},{"$f":"IF(G68=0,\"\",INDEX(Risk_Factors!$O$15:$T$17,MATCH('1_Risk_Calc'!G68,Position,0),MATCH($E68,Risk_Factors!$O$8:$T$8,0)))","v":""},{"$f":"IF(H68=0,\"\",INDEX(Risk_Factors!$O$18:$T$19,MATCH('1_Risk_Calc'!H68,Yes_No,0),MATCH($E68,Risk_Factors!$O$8:$T$8,0)))","v":""},{"$f":"IF(I68=0,\"\",INDEX(Risk_Factors!$O$20:$T$22,MATCH('1_Risk_Calc'!I68,Dust_amount,0),MATCH($E68,Risk_Factors!$O$8:$T$8,0)))","v":""},{"$f":"IF(J68=0,\"\",INDEX(Risk_Factors!$O$23:$T$25,MATCH('1_Risk_Calc'!J68,Dust_composition,0),MATCH($E68,Risk_Factors!$O$8:$T$8,0)))","v":""},{"$f":"IF(K68=0,\"\",INDEX(Risk_Factors!$O$26:$T$28,MATCH('1_Risk_Calc'!K68,Dust_size,0),MATCH($E68,Risk_Factors!$O$8:$T$8,0)))","v":""},{"$f":"IF(L68=0,\"\",INDEX(Risk_Factors!$O$29:$T$30,MATCH('1_Risk_Calc'!L68,Risk_Factors!$E$29:$E$30,0),MATCH($E68,Risk_Factors!$O$8:$T$8,0)))","v":""},{"$f":"IF(M68=0,\"\",INDEX(Risk_Factors!$O$32:$T$33,MATCH('1_Risk_Calc'!M68,Risk_Factors!$E$32:$E$33,0),MATCH($E68,Risk_Factors!$O$8:$T$8,0)))","v":""},{"$f":"IF(N68=0,\"\",INDEX(Risk_Factors!$O$35:$T$36,MATCH('1_Risk_Calc'!N68,Risk_Factors!$E$35:$E$36,0),MATCH($E68,Risk_Factors!$O$8:$T$8,0)))","v":""},{"$f":"IF(O68=0,\"\",INDEX(Risk_Factors!$O$38:$T$39,MATCH('1_Risk_Calc'!O68,Risk_Factors!$E$38:$E$39,0),MATCH($E68,Risk_Factors!$O$8:$T$8,0)))","v":""},{"$f":"IF(P68=0,\"\",INDEX(Risk_Factors!$O$41:$T$42,MATCH('1_Risk_Calc'!P68,Risk_Factors!$E$41:$E$42,0),MATCH($E68,Risk_Factors!$O$8:$T$8,0)))","v":""},0,0,null,null,null,"S_059",0]
[null,"S_060",null,null,null,null,null,null,null,null,null,null,null,null,null,null,{"$f":"IF(F69=0,\"\",INDEX(Risk_Factors!$O$12:$T$14,MATCH(F69,Frequency,0),MATCH($E69,Risk_Factors!$O$8:$T$8,0)))","v":""},{"$f":"IF(G69=0,\"\",INDEX(Risk_Factors!$O$15:$T$17,MATCH('1_Risk_Calc'!G69,Position,0),MATCH($E69,Risk_Factors!$O$8:$T$8,0)))","v":""},{"$f":"IF(H69=0,\"\",INDEX(Risk_Factors!$O$18:$T$19,MATCH('1_Risk_Calc'!H69,Yes_No,0),MATCH($E69,Risk_Factors!$O$8:$T$8,0)))","v":""},{"$f":"IF(I69=0,\"\",INDEX(Risk_Factors!$O$20:$T$22,MATCH('1_Risk_Calc'!I69,Dust_amount,0),MATCH($E69,Risk_Factors!$O$8:$T$8,0)))","v":""},{"$f":"IF(J69=0,\"\",INDEX(Risk_Factors!$O$23:$T$25,MATCH('1_Risk_Calc'!J69,Dust_composition,0),MATCH($E69,Risk_Factors!$O$8:$T$8,0)))","v":""},{"$f":"IF(K69=0,\"\",INDEX(Risk_Factors!$O$26:$T$28,MATCH('1_Risk_Calc'!K69,Dust_size,0),MATCH($E69,Risk_Factors!$O$8:$T$8,0)))","v":""},{"$f":"IF(L69=0,\"\",INDEX(Risk_Factors!$O$29:$T$30,MATCH('1_Risk_Calc'!L69,Risk_Factors!$E$29:$E$30,0),MATCH($E69,Risk_Factors!$O$8:$T$8,0)))","v":""},{"$f":"IF(M69=0,\"\",INDEX(Risk_Factors!$O$32:$T$33,MATCH('1_Risk_Calc'!M69,Risk_Factors!$E$32:$E$33,0),MATCH($E69,Risk_Factors!$O$8:$T$8,0)))","v":""},{"$f":"IF(N69=0,\"\",INDEX(Risk_Factors!$O$35:$T$36,MATCH('1_Risk_Calc'!N69,Risk_Factors!$E$35:$E$36,0),MATCH($E69,Risk_Factors!$O$8:$T$8,0)))","v":""},{"$f":"IF(O69=0,\"\",INDEX(Risk_Factors!$O$38:$T$39,MATCH('1_Risk_Calc'!O69,Risk_Factors!$E$38:$E$39,0),MATCH($E69,Risk_Factors!$O$8:$T$8,0)))","v":""},{"$f":"IF(P69=0,\"\",INDEX(Risk_Factors!$O$41:$T$42,MATCH('1_Risk_Calc'!P69,Risk_Factors!$E$41:$E$42,0),MATCH($E69,Risk_Factors!$O$8:$T$8,0)))","v":""},0,0,null,null,null,"S_060",0]
[null,"S_061",null,null,null,null,null,null,null,null,null,null,null,null,null,null,{"$f":"IF(F70=0,\"\",INDEX(Risk_Factors!$O$12:$T$14,MATCH(F70,Frequency,0),MATCH($E70,Risk_Factors!$O$8:$T$8,0)))","v":""},{"$f":"IF(G70=0,\"\",INDEX(Risk_Factors!$O$15:$T$17,MATCH('1_Risk_Calc'!G70,Position,0),MATCH($E70,Risk_Factors!$O$8:$T$8,0)))","v":""},{"$f":"IF(H70=0,\"\",INDEX(Risk_Factors!$O$18:$T$19,MATCH('1_Risk_Calc'!H70,Yes_No,0),MATCH($E70,Risk_Factors!$O$8:$T$8,0)))","v":""},{"$f":"IF(I70=0,\"\",INDEX(Risk_Factors!$O$20:$T$22,MATCH('1_Risk_Calc'!I70,Dust_amount,0),MATCH($E70,Risk_Factors!$O$8:$T$8,0)))","v":""},{"$f":"IF(J70=0,\"\",INDEX(Risk_Factors!$O$23:$T$25,MATCH('1_Risk_Calc'!J70,Dust_composition,0),MATCH($E70,Risk_Factors!$O$8:$T$8,0)))","v":""},{"$f":"IF(K70=0,\"\",INDEX(Risk_Factors!$O$26:$T$28,MATCH('1_Risk_Calc'!K70,Dust_size,0),MATCH($E70,Risk_Factors!$O$8:$T$8,0)))","v":""},{"$f":"IF(L70=0,\"\",INDEX(Risk_Factors!$O$29:$T$30,MATCH('1_Risk_Calc'!L70,Risk_Factors!$E$29:$E$30,0),MATCH($E70,Risk_Factors!$O$8:$T$8,0)))","v":""},{"$f":"IF(M70=0,\"\",INDEX(Risk_Factors!$O$32:$T$33,MATCH('1_Risk_Calc'!M70,Risk_Factors!$E$32:$E$33,0),MATCH($E70,Risk_Factors!$O$8:$T$8,0)))","v":""},{"$f":"IF(N70=0,\"\",INDEX(Risk_Factors!$O$35:$T$36,MATCH('1_Risk_Calc'!N70,Risk_Factors!$E$35:$E$36,0),MATCH($E70,Risk_Factors!$O$8:$T$8,0)))","v":""},{"$f":"IF(O70=0,\"\",INDEX(Risk_Factors!$O$38:$T$39,MATCH('1_Risk_Calc'!O70,Risk_Factors!$E$38:$E$39,0),MATCH($E70,Risk_Factors!$O$8:$T$8,0)))","v":""},{"$f":"IF(P70=0,\"\",INDEX(Risk_Factors!$O$41:$T$42,MATCH('1_Risk_Calc'!P70,Risk_Factors!$E$41:$E$42,0),MATCH($E70,Risk_Factors!$O$8:$T$8,0)))","v":""},0,0,null,null,null,"S_061",0]
[null,"S_062",null,null,null,null,null,null,null,null,null,null,null,null,null,null,{"$f":"IF(F71=0,\"\",INDEX(Risk_Factors!$O$12:$T$14,MATCH(F71,Frequency,0),MATCH($E71,Risk_Factors!$O$8:$T$8,0)))","v":""},{"$f":"IF(G71=0,\"\",INDEX(Risk_Factors!$O$15:$T$17,MATCH('1_Risk_Calc'!G71,Position,0),MATCH($E71,Risk_Factors!$O$8:$T$8,0)))","v":""},{"$f":"IF(H71=0,\"\",INDEX(Risk_Factors!$O$18:$T$19,MATCH('1_Risk_Calc'!H71,Yes_No,0),MATCH($E71,Risk_Factors!$O$8:$T$8,0)))","v":""},{"$f":"IF(I71=0,\"\",INDEX(Risk_Factors!$O$20:$T$22,MATCH('1_Risk_Calc'!I71,Dust_amount,0),MATCH($E71,Risk_Factors!$O$8:$T$8,0)))","v":""},{"$f":"IF(J71=0,\"\",INDEX(Risk_Factors!$O$23:$T$25,MATCH('1_Risk_Calc'!J71,Dust_composition,0),MATCH($E71,Risk_Factors!$O$8:$T$8,0)))","v":""},{"$f":"IF(K71=0,\"\",INDEX(Risk_Factors!$O$26:$T$28,MATCH('1_Risk_Calc'!K71,Dust_size,0),MATCH($E71,Risk_Factors!$O$8:$T$8,0)))","v":""},{"$f":"IF(L71=0,\"\",INDEX(Risk_Factors!$O$29:$T$30,MATCH('1_Risk_Calc'!L71,Risk_Factors!$E$29:$E$30,0),MATCH($E71,Risk_Factors!$O$8:$T$8,0)))","v":""},{"$f":"IF(M71=0,\"\",INDEX(Risk_Factors!$O$32:$T$33,MATCH('1_Risk_Calc'!M71,Risk_Factors!$E$32:$E$33,0),MATCH($E71,Risk_Factors!$O$8:$T$8,0)))","v":""},{"$f":"IF(N71=0,\"\",INDEX(Risk_Factors!$O$35:$T$36,MATCH('1_Risk_Calc'!N71,Risk_Factors!$E$35:$E$36,0),MATCH($E71,Risk_Factors!$O$8:$T$8,0)))","v":""},{"$f":"IF(O71=0,\"\",INDEX(Risk_Factors!$O$38:$T$39,MATCH('1_Risk_Calc'!O71,Risk_Factors!$E$38:$E$39,0),MATCH($E71,Risk_Factors!$O$8:$T$8,0)))","v":""},{"$f":"IF(P71=0,\"\",INDEX(Risk_Factors!$O$41:$T$42,MATCH('1_Risk_Calc'!P71,Risk_Factors!$E$41:$E$42,0),MATCH($E71,Risk_Factors!$O$8:$T$8,0)))","v":""},0,0,null,null,null,"S_062",0]
[null,"S_063",null,null,null,null,null,null,null,null,null,null,null,null,null,null,{"$f":"IF(F72=0,\"\",INDEX(Risk_Factors!$O$12:$T$14,MATCH(F72,Frequency,0),MATCH($E72,Risk_Factors!$O$8:$T$8,0)))","v":""},{"$f":"IF(G72=0,\"\",INDEX(Risk_Factors!$O$15:$T$17,MATCH('1_Risk_Calc'!G72,Position,0),MATCH($E72,Risk_Factors!$O$8:$T$8,0)))","v":""},{"$f":"IF(H72=0,\"\",INDEX(Risk_Factors!$O$18:$T$19,MATCH('1_Risk_Calc'!H72,Yes_No,0),MATCH($E72,Risk_Factors!$O$8:$T$8,0)))","v":""},{"$f":"IF(I72=0,\"\",INDEX(Risk_Factors!$O$20:$T$22,MATCH('1_Risk_Calc'!I72,Dust_amount,0),MATCH($E72,Risk_Factors!$O$8:$T$8,0)))","v":""},{"$f":"IF(J72=0,\"\",INDEX(Risk_Factors!$O$23:$T$25,MATCH('1_Risk_Calc'!J72,Dust_composition,0),MATCH($E72,Risk_Factors!$O$8:$T$8,0)))","v":""},{"$f":"IF(K72=0,\"\",INDEX(Risk_Factors!$O$26:$T$28,MATCH('1_Risk_Calc'!K72,Dust_size,0),MATCH($E72,Risk_Factors!$O$8:$T$8,0)))","v":""},{"$f":"IF(L72=0,\"\",INDEX(Risk_Factors!$O$29:$T$30,MATCH('1_Risk_Calc'!L72,Risk_Factors!$E$29:$E$30,0),MATCH($E72,Risk_Factors!$O$8:$T$8,0)))","v":""},{"$f":"IF(M72=0,\"\",INDEX(Risk_Factors!$O$32:$T$33,MATCH('1_Risk_Calc'!M72,Risk_Factors!$E$32:$E$33,0),MATCH($E72,Risk_Factors!$O$8:$T$8,0)))","v":""},{"$f":"IF(N72=0,\"\",INDEX(Risk_Factors!$O$35:$T$36,MATCH('1_Risk_Calc'!N72,Risk_Factors!$E$35:$E$36,0),MATCH($E72,Risk_Factors!$O$8:$T$8,0)))","v":""},{"$f":"IF(O72=0,\"\",INDEX(Risk_Factors!$O$38:$T$39,MATCH('1_Risk_Calc'!O72,Risk_Factors!$E$38:$E$39,0),MATCH($E72,Risk_Factors!$O$8:$T$8,0)))","v":""},{"$f":"IF(P72=0,\"\",INDEX(Risk_Factors!$O$41:$T$42,MATCH('1_Risk_Calc'!P72,Risk_Factors!$E$41:$E$42,0),MATCH($E72,Risk_Factors!$O$8:$T$8,0)))","v":""},0,0,null,null,null,"S_063",0]
[null,"S_064",null,null,null,null,null,null,null,null,null,null,null,null,null,null,{"$f":"IF(F73=0,\"\",INDEX(Risk_Factors!$O$12:$T$14,MATCH(F73,Frequency,0),MATCH($E73,Risk_Factors!$O$8:$T$8,0)))","v":""},{"$f":"IF(G73=0,\"\",INDEX(Risk_Factors!$O$15:$T$17,MATCH('1_Risk_Calc'!G73,Position,0),MATCH($E73,Risk_Factors!$O$8:$T$8,0)))","v":""},{"$f":"IF(H73=0,\"\",INDEX(Risk_Factors!$O$18:$T$19,MATCH('1_Risk_Calc'!H73,Yes_No,0),MATCH($E73,Risk_Factors!$O$8:$T$8,0)))","v":""},{"$f":"IF(I73=0,\"\",INDEX(Risk_Factors!$O$20:$T$22,MATCH('1_Risk_Calc'!I73,Dust_amount,0),MATCH($E73,Risk_Factors!$O$8:$T$8,0)))","v":""},{"$f":"IF(J73=0,\"\",INDEX(Risk_Factors!$O$23:$T$25,MATCH('1_Risk_Calc'!J73,Dust_composition,0),MATCH($E73,Risk_Factors!$O$8:$T$8,0)))","v":""},{"$f":"IF(K73=0,\"\",INDEX(Risk_Factors!$O$26:$T$28,MATCH('1_Risk_Calc'!K73,Dust_size,0),MATCH($E73,Risk_Factors!$O$8:$T$8,0)))","v":""},{"$f":"IF(L73=0,\"\",INDEX(Risk_Factors!$O$29:$T$30,MATCH('1_Risk_Calc'!L73,Risk_Factors!$E$29:$E$30,0),MATCH($E73,Risk_Factors!$O$8:$T$8,0)))","v":""},{"$f":"IF(M73=0,\"\",INDEX(Risk_Factors!$O$32:$T$33,MATCH('1_Risk_Calc'!M73,Risk_Factors!$E$32:$E$33,0),MATCH($E73,Risk_Factors!$O$8:$T$8,0)))","v":""},{"$f":"IF(N73=0,\"\",INDEX(Risk_Factors!$O$35:$T$36,MATCH('1_Risk_Calc'!N73,Risk_Factors!$E$35:$E$36,0),MATCH($E73,Risk_Factors!$O$8:$T$8,0)))","v":""},{"$f":"IF(O73=0,\"\",INDEX(Risk_Factors!$O$38:$T$39,MATCH('1_Risk_Calc'!O73,Risk_Factors!$E$38:$E$39,0),MATCH($E73,Risk_Factors!$O$8:$T$8,0)))","v":""},{"$f":"IF(P73=0,\"\",INDEX(Risk_Factors!$O$41:$T$42,MATCH('1_Risk_Calc'!P73,Risk_Factors!$E$41:$E$42,0),MATCH($E73,Risk_Factors!$O$8:$T$8,0)))","v":""},0,0,null,null,null,"S_064",0]
[null,"S_065",null,null,null,null,null,null,null,null,null,null,null,null,null,null,{"$f":"IF(F74=0,\"\",INDEX(Risk_Factors!$O$12:$T$14,MATCH(F74,Frequency,0),MATCH($E74,Risk_Factors!$O$8:$T$8,0)))","v":""},{"$f":"IF(G74=0,\"\",INDEX(Risk_Factors!$O$15:$T$17,MATCH('1_Risk_Calc'!G74,Position,0),MATCH($E74,Risk_Factors!$O$8:$T$8,0)))","v":""},{"$f":"IF(H74=0,\"\",INDEX(Risk_Factors!$O$18:$T$19,MATCH('1_Risk_Calc'!H74,Yes_No,0),MATCH($E74,Risk_Factors!$O$8:$T$8,0)))","v":""},{"$f":"IF(I74=0,\"\",INDEX(Risk_Factors!$O$20:$T$22,MATCH('1_Risk_Calc'!I74,Dust_amount,0),MATCH($E74,Risk_Factors!$O$8:$T$8,0)))","v":""},{"$f":"IF(J74=0,\"\",INDEX(Risk_Factors!$O$23:$T$25,MATCH('1_Risk_Calc'!J74,Dust_composition,0),MATCH($E74,Risk_Factors!$O$8:$T$8,0)))","v":""},{"$f":"IF(K74=0,\"\",INDEX(Risk_Factors!$O$26:$T$28,MATCH('1_Risk_Calc'!K74,Dust_size,0),MATCH($E74,Risk_Factors!$O$8:$T$8,0)))","v":""},{"$f":"IF(L74=0,\"\",INDEX(Risk_Factors!$O$29:$T$30,MATCH('1_Risk_Calc'!L74,Risk_Factors!$E$29:$E$30,0),MATCH($E74,Risk_Factors!$O$8:$T$8,0)))","v":""},{"$f":"IF(M74=0,\"\",INDEX(Risk_Factors!$O$32:$T$33,MATCH('1_Risk_Calc'!M74,Risk_Factors!$E$32:$E$33,0),MATCH($E74,Risk_Factors!$O$8:$T$8,0)))","v":""},{"$f":"IF(N74=0,\"\",INDEX(Risk_Factors!$O$35:$T$36,MATCH('1_Risk_Calc'!N74,Risk_Factors!$E$35:$E$36,0),MATCH($E74,Risk_Factors!$O$8:$T$8,0)))","v":""},{"$f":"IF(O74=0,\"\",INDEX(Risk_Factors!$O$38:$T$39,MATCH('1_Risk_Calc'!O74,Risk_Factors!$E$38:$E$39,0),MATCH($E74,Risk_Factors!$O$8:$T$8,0)))","v":""},{"$f":"IF(P74=0,\"\",INDEX(Risk_Factors!$O$41:$T$42,MATCH('1_Risk_Calc'!P74,Risk_Factors!$E$41:$E$42,0),MATCH($E74,Risk_Factors!$O$8:$T$8,0)))","v":""},0,{"$f":"(AB74/MAX($AB$10:$AB$109))*$AC$5","v":0},null,null,null,"S_065",0]
[null,"S_066",null,null,null,null,null,null,null,null,null,null,null,null,null,null,{"$f":"IF(F75=0,\"\",INDEX(Risk_Factors!$O$12:$T$14,MATCH(F75,Frequency,0),MATCH($E75,Risk_Factors!$O$8:$T$8,0)))","v":""},{"$f":"IF(G75=0,\"\",INDEX(Risk_Factors!$O$15:$T$17,MATCH('1_Risk_Calc'!G75,Position,0),MATCH($E75,Risk_Factors!$O$8:$T$8,0)))","v":""},{"$f":"IF(H75=0,\"\",INDEX(Risk_Factors!$O$18:$T$19,MATCH('1_Risk_Calc'!H75,Yes_No,0),MATCH($E75,Risk_Factors!$O$8:$T$8,0)))","v":""},{"$f":"IF(I75=0,\"\",INDEX(Risk_Factors!$O$20:$T$22,MATCH('1_Risk_Calc'!I75,Dust_amount,0),MATCH($E75,Risk_Factors!$O$8:$T$8,0)))","v":""},{"$f":"IF(J75=0,\"\",INDEX(Risk_Factors!$O$23:$T$25,MATCH('1_Risk_Calc'!J75,Dust_composition,0),MATCH($E75,Risk_Factors!$O$8:$T$8,0)))","v":""},{"$f":"IF(K75=0,\"\",INDEX(Risk_Factors!$O$26:$T$28,MATCH('1_Risk_Calc'!K75,Dust_size,0),MATCH($E75,Risk_Factors!$O$8:$T$8,0)))","v":""},{"$f":"IF(L75=0,\"\",INDEX(Risk_Factors!$O$29:$T$30,MATCH('1_Risk_Calc'!L75,Risk_Factors!$E$29:$E$30,0),MATCH($E75,Risk_Factors!$O$8:$T$8,0)))","v":""},{"$f":"IF(M75=0,\"\",INDEX(Risk_Factors!$O$32:$T$33,MATCH('1_Risk_Calc'!M75,Risk_Factors!$E$32:$E$33,0),MATCH($E75,Risk_Factors!$O$8:$T$8,0)))","v":""},{"$f":"IF(N75=0,\"\",INDEX(Risk_Factors!$O$35:$T$36,MATCH('1_Risk_Calc'!N75,Risk_Factors!$E$35:$E$36,0),MATCH($E75,Risk_Factors!$O$8:$T$8,0)))","v":""},{"$f":"IF(O75=0,\"\",INDEX(Risk_Factors!$O$38:$T$39,MATCH('1_Risk_Calc'!O75,Risk_Factors!$E$38:$E$39,0),MATCH($E75,Risk_Factors!$O$8:$T$8,0)))","v":""},{"$f":"IF(P75=0,\"\",INDEX(Risk_Factors!$O$41:$T$42,MATCH('1_Risk_Calc'!P75,Risk_Factors!$E$41:$E$42,0),MATCH($E75,Risk_Factors!$O$8:$T$8,0)))","v":""},0,0,null,null,null,{"$f":"B75","v":"S_066"},{"$f":"AC75","v":0}]
[null,"S_067",null,null,null,null,null,null,null,null,null,null,null,null,null,null,{"$f":"IF(F76=0,\"\",INDEX(Risk_Factors!$O$12:$T$14,MATCH(F76,Frequency,0),MATCH($E76,Risk_Factors!$O$8:$T$8,0)))","v":""},{"$f":"IF(G76=0,\"\",INDEX(Risk_Factors!$O$15:$T$17,MATCH('1_Risk_Calc'!G76,Position,0),MATCH($E76,Risk_Factors!$O$8:$T$8,0)))","v":""},{"$f":"IF(H76=0,\"\",INDEX(Risk_Factors!$O$18:$T$19,MATCH('1_Risk_Calc'!H76,Yes_No,0),MATCH($E76,Risk_Factors!$O$8:$T$8,0)))","v":""},{"$f":"IF(I76=0,\"\",INDEX(Risk_Factors!$O$20:$T$22,MATCH('1_Risk_Calc'!I76,Dust_amount,0),MATCH($E76,Risk_Factors!$O$8:$T$8,0)))","v":""},{"$f":"IF(J76=0,\"\",INDEX(Risk_Factors!$O$23:$T$25,MATCH('1_Risk_Calc'!J76,Dust_composition,0),MATCH($E76,Risk_Factors!$O$8:$T$8,0)))","v":""},{"$f":"IF(K76=0,\"\",INDEX(Risk_Factors!$O$26:$T$28,MATCH('1_Risk_Calc'!K76,Dust_size,0),MATCH($E76,Risk_Factors!$O$8:$T$8,0)))","v":""},{"$f":"IF(L76=0,\"\",INDEX(Risk_Factors!$O$29:$T$30,MATCH('1_Risk_Calc'!L76,Risk_Factors!$E$29:$E$30,0),MATCH($E76,Risk_Factors!$O$8:$T$8,0)))","v":""},{"$f":"IF(M76=0,\"\",INDEX(Risk_Factors!$O$32:$T$33,MATCH('1_Risk_Calc'!M76,Risk_Factors!$E$32:$E$33,0),MATCH($E76,Risk_Factors!$O$8:$T$8,0)))","v":""},{"$f":"IF(N76=0,\"\",INDEX(Risk_Factors!$O$35:$T$36,MATCH('1_Risk_Calc'!N76,Risk_Factors!$E$35:$E$36,0),MATCH($E76,Risk_Factors!$O$8:$T$8,0)))","v":""},{"$f":"IF(O76=0,\"\",INDEX(Risk_Factors!$O$38:$T$39,MATCH('1_Risk_Calc'!O76,Risk_Factors!$E$38:$E$39,0),MATCH($E76,Risk_Factors!$O$8:$T$8,0)))","v":""},{"$f":"IF(P76=0,\"\",INDEX(Risk_Factors!$O$41:$T$42,MATCH('1_Risk_Calc'!P76,Risk_Factors!$E$41:$E$42,0),MATCH($E76,Risk_Factors!$O$8:$T$8,0)))","v":""},0,0,null,null,null,"S_067",0]
[null,"S_068",null,null,null,null,null,null,null,null,null,null,null,null,null,null,{"$f":"IF(F77=0,\"\",INDEX(Risk_Factors!$O$12:$T$14,MATCH(F77,Frequency,0),MATCH($E77,Risk_Factors!$O$8:$T$8,0)))","v":""},{"$f":"IF(G77=0,\"\",INDEX(Risk_Factors!$O$15:$T$17,MATCH('1_Risk_Calc'!G77,Position,0),MATCH($E77,Risk_Factors!$O$8:$T$8,0)))","v":""},{"$f":"IF(H77=0,\"\",INDEX(Risk_Factors!$O$18:$T$19,MATCH('1_Risk_Calc'!H77,Yes_No,0),MATCH($E77,Risk_Factors!$O$8:$T$8,0)))","v":""},{"$f":"IF(I77=0,\"\",INDEX(Risk_Factors!$O$20:$T$22,MATCH('1_Risk_Calc'!I77,Dust_amount,0),MATCH($E77,Risk_Factors!$O$8:$T$8,0)))","v":""},{"$f":"IF(J77=0,\"\",INDEX(Risk_Factors!$O$23:$T$25,MATCH('1_Risk_Calc'!J77,Dust_composition,0),MATCH($E77,Risk_Factors!$O$8:$T$8,0)))","v":""},{"$f":"IF(K77=0,\"\",INDEX(Risk_Factors!$O$26:$T$28,MATCH('1_Risk_Calc'!K77,Dust_size,0),MATCH($E77,Risk_Factors!$O$8:$T$8,0)))","v":""},{"$f":"IF(L77=0,\"\",INDEX(Risk_Factors!$O$29:$T$30,MATCH('1_Risk_Calc'!L77,Risk_Factors!$E$29:$E$30,0),MATCH($E77,Risk_Factors!$O$8:$T$8,0)))","v":""},{"$f":"IF(M77=0,\"\",INDEX(Risk_Factors!$O$32:$T$33,MATCH('1_Risk_Calc'!M77,Risk_Factors!$E$32:$E$33,0),MATCH($E77,Risk_Factors!$O$8:$T$8,0)))","v":""},{"$f":"IF(N77=0,\"\",INDEX(Risk_Factors!$O$35:$T$36,MATCH('1_Risk_Calc'!N77,Risk_Factors!$E$35:$E$36,0),MATCH($E77,Risk_Factors!$O$8:$T$8,0)))","v":""},{"$f":"IF(O77=0,\"\",INDEX(Risk_Factors!$O$38:$T$39,MATCH('1_Risk_Calc'!O77,Risk_Factors!$E$38:$E$39,0),MATCH($E77,Risk_Factors!$O$8:$T$8,0)))","v":""},{"$f":"IF(P77=0,\"\",INDEX(Risk_Factors!$O$41:$T$42,MATCH('1_Risk_Calc'!P77,Risk_Factors!$E$41:$E$42,0),MATCH($E77,Risk_Factors!$O$8:$T$8,0)))","v":""},0,0,null,null,null,"S_068",0]
[null,"S_069",null,null,null,null,null,null,null,null,null,null,null,null,null,null,{"$f":"IF(F78=0,\"\",INDEX(Risk_Factors!$O$12:$T$14,MATCH(F78,Frequency,0),MATCH($E78,Risk_Factors!$O$8:$T$8,0)))","v":""},{"$f":"IF(G78=0,\"\",INDEX(Risk_Factors!$O$15:$T$17,MATCH('1_Risk_Calc'!G78,Position,0),MATCH($E78,Risk_Factors!$O$8:$T$8,0)))","v":""},{"$f":"IF(H78=0,\"\",INDEX(Risk_Factors!$O$18:$T$19,MATCH('1_Risk_Calc'!H78,Yes_No,0),MATCH($E78,Risk_Factors!$O$8:$T$8,0)))","v":""},{"$f":"IF(I78=0,\"\",INDEX(Risk_Factors!$O$20:$T$22,MATCH('1_Risk_Calc'!I78,Dust_amount,0),MATCH($E78,Risk_Factors!$O$8:$T$8,0)))","v":""},{"$f":"IF(J78=0,\"\",INDEX(Risk_Factors!$O$23:$T$25,MATCH('1_Risk_Calc'!J78,Dust_composition,0),MATCH($E78,Risk_Factors!$O$8:$T$8,0)))","v":""},{"$f":"IF(K78=0,\"\",INDEX(Risk_Factors!$O$26:$T$28,MATCH('1_Risk_Calc'!K78,Dust_size,0),MATCH($E78,Risk_Factors!$O$8:$T$8,0)))","v":""},{"$f":"IF(L78=0,\"\",INDEX(Risk_Factors!$O$29:$T$30,MATCH('1_Risk_Calc'!L78,Risk_Factors!$E$29:$E$30,0),MATCH($E78,Risk_Factors!$O$8:$T$8,0)))","v":""},{"$f":"IF(M78=0,\"\",INDEX(Risk_Factors!$O$32:$T$33,MATCH('1_Risk_Calc'!M78,Risk_Factors!$E$32:$E$33,0),MATCH($E78,Risk_Factors!$O$8:$T$8,0)))","v":""},{"$f":"IF(N78=0,\"\",INDEX(Risk_Factors!$O$35:$T$36,MATCH('1_Risk_Calc'!N78,Risk_Factors!$E$35:$E$36,0),MATCH($E78,Risk_Factors!$O$8:$T$8,0)))","v":""},{"$f":"IF(O78=0,\"\",INDEX(Risk_Factors!$O$38:$T$39,MATCH('1_Risk_Calc'!O78,Risk_Factors!$E$38:$E$39,0),MATCH($E78,Risk_Factors!$O$8:$T$8,0)))","v":""},{"$f":"IF(P78=0,\"\",INDEX(Risk_Factors!$O$41:$T$42,MATCH('1_Risk_Calc'!P78,Risk_Factors!$E$41:$E$42,0),MATCH($E78,Risk_Factors!$O$8:$T$8,0)))","v":""},0,0,null,null,null,"S_069",0]
[null,"S_070",null,null,null,null,null,null,null,null,null,null,null,null,null,null,{"$f":"IF(F79=0,\"\",INDEX(Risk_Factors!$O$12:$T$14,MATCH(F79,Frequency,0),MATCH($E79,Risk_Factors!$O$8:$T$8,0)))","v":""},{"$f":"IF(G79=0,\"\",INDEX(Risk_Factors!$O$15:$T$17,MATCH('1_Risk_Calc'!G79,Position,0),MATCH($E79,Risk_Factors!$O$8:$T$8,0)))","v":""},{"$f":"IF(H79=0,\"\",INDEX(Risk_Factors!$O$18:$T$19,MATCH('1_Risk_Calc'!H79,Yes_No,0),MATCH($E79,Risk_Factors!$O$8:$T$8,0)))","v":""},{"$f":"IF(I79=0,\"\",INDEX(Risk_Factors!$O$20:$T$22,MATCH('1_Risk_Calc'!I79,Dust_amount,0),MATCH($E79,Risk_Factors!$O$8:$T$8,0)))","v":""},{"$f":"IF(J79=0,\"\",INDEX(Risk_Factors!$O$23:$T$25,MATCH('1_Risk_Calc'!J79,Dust_composition,0),MATCH($E79,Risk_Factors!$O$8:$T$8,0)))","v":""},{"$f":"IF(K79=0,\"\",INDEX(Risk_Factors!$O$26:$T$28,MATCH('1_Risk_Calc'!K79,Dust_size,0),MATCH($E79,Risk_Factors!$O$8:$T$8,0)))","v":""},{"$f":"IF(L79=0,\"\",INDEX(Risk_Factors!$O$29:$T$30,MATCH('1_Risk_Calc'!L79,Risk_Factors!$E$29:$E$30,0),MATCH($E79,Risk_Factors!$O$8:$T$8,0)))","v":""},{"$f":"IF(M79=0,\"\",INDEX(Risk_Factors!$O$32:$T$33,MATCH('1_Risk_Calc'!M79,Risk_Factors!$E$32:$E$33,0),MATCH($E79,Risk_Factors!$O$8:$T$8,0)))","v":""},{"$f":"IF(N79=0,\"\",INDEX(Risk_Factors!$O$35:$T$36,MATCH('1_Risk_Calc'!N79,Risk_Factors!$E$35:$E$36,0),MATCH($E79,Risk_Factors!$O$8:$T$8,0)))","v":""},{"$f":"IF(O79=0,\"\",INDEX(Risk_Factors!$O$38:$T$39,MATCH('1_Risk_Calc'!O79,Risk_Factors!$E$38:$E$39,0),MATCH($E79,Risk_Factors!$O$8:$T$8,0)))","v":""},{"$f":"IF(P79=0,\"\",INDEX(Risk_Factors!$O$41:$T$42,MATCH('1_Risk_Calc'!P79,Risk_Factors!$E$41:$E$42,0),MATCH($E79,Risk_Factors!$O$8:$T$8,0)))","v":""},0,0,null,null,null,"S_070",0]
[null,"S_071",null,null,null,null,null,null,null,null,null,null,null,null,null,null,{"$f":"IF(F80=0,\"\",INDEX(Risk_Factors!$O$12:$T$14,MATCH(F80,Frequency,0),MATCH($E80,Risk_Factors!$O$8:$T$8,0)))","v":""},{"$f":"IF(G80=0,\"\",INDEX(Risk_Factors!$O$15:$T$17,MATCH('1_Risk_Calc'!G80,Position,0),MATCH($E80,Risk_Factors!$O$8:$T$8,0)))","v":""},{"$f":"IF(H80=0,\"\",INDEX(Risk_Factors!$O$18:$T$19,MATCH('1_Risk_Calc'!H80,Yes_No,0),MATCH($E80,Risk_Factors!$O$8:$T$8,0)))","v":""},{"$f":"IF(I80=0,\"\",INDEX(Risk_Factors!$O$20:$T$22,MATCH('1_Risk_Calc'!I80,Dust_amount,0),MATCH($E80,Risk_Factors!$O$8:$T$8,0)))","v":""},{"$f":"IF(J80=0,\"\",INDEX(Risk_Factors!$O$23:$T$25,MATCH('1_Risk_Calc'!J80,Dust_composition,0),MATCH($E80,Risk_Factors!$O$8:$T$8,0)))","v":""},{"$f":"IF(K80=0,\"\",INDEX(Risk_Factors!$O$26:$T$28,MATCH('1_Risk_Calc'!K80,Dust_size,0),MATCH($E80,Risk_Factors!$O$8:$T$8,0)))","v":""},{"$f":"IF(L80=0,\"\",INDEX(Risk_Factors!$O$29:$T$30,MATCH('1_Risk_Calc'!L80,Risk_Factors!$E$29:$E$30,0),MATCH($E80,Risk_Factors!$O$8:$T$8,0)))","v":""},{"$f":"IF(M80=0,\"\",INDEX(Risk_Factors!$O$32:$T$33,MATCH('1_Risk_Calc'!M80,Risk_Factors!$E$32:$E$33,0),MATCH($E80,Risk_Factors!$O$8:$T$8,0)))","v":""},{"$f":"IF(N80=0,\"\",INDEX(Risk_Factors!$O$35:$T$36,MATCH('1_Risk_Calc'!N80,Risk_Factors!$E$35:$E$36,0),MATCH($E80,Risk_Factors!$O$8:$T$8,0)))","v":""},{"$f":"IF(O80=0,\"\",INDEX(Risk_Factors!$O$38:$T$39,MATCH('1_Risk_Calc'!O80,Risk_Factors!$E$38:$E$39,0),MATCH($E80,Risk_Factors!$O$8:$T$8,0)))","v":""},{"$f":"IF(P80=0,\"\",INDEX(Risk_Factors!$O$41:$T$42,MATCH('1_Risk_Calc'!P80,Risk_Factors!$E$41:$E$42,0),MATCH($E80,Risk_Factors!$O$8:$T$8,0)))","v":""},0,0,null,null,null,"S_071",0]
[null,"S_072",null,null,null,null,null,null,null,null,null,null,null,null,null,null,{"$f":"IF(F81=0,\"\",INDEX(Risk_Factors!$O$12:$T$14,MATCH(F81,Frequency,0),MATCH($E81,Risk_Factors!$O$8:$T$8,0)))","v":""},{"$f":"IF(G81=0,\"\",INDEX(Risk_Factors!$O$15:$T$17,MATCH('1_Risk_Calc'!G81,Position,0),MATCH($E81,Risk_Factors!$O$8:$T$8,0)))","v":""},{"$f":"IF(H81=0,\"\",INDEX(Risk_Factors!$O$18:$T$19,MATCH('1_Risk_Calc'!H81,Yes_No,0),MATCH($E81,Risk_Factors!$O$8:$T$8,0)))","v":""},{"$f":"IF(I81=0,\"\",INDEX(Risk_Factors!$O$20:$T$22,MATCH('1_Risk_Calc'!I81,Dust_amount,0),MATCH($E81,Risk_Factors!$O$8:$T$8,0)))","v":""},{"$f":"IF(J81=0,\"\",INDEX(Risk_Factors!$O$23:$T$25,MATCH('1_Risk_Calc'!J81,Dust_composition,0),MATCH($E81,Risk_Factors!$O$8:$T$8,0)))","v":""},{"$f":"IF(K81=0,\"\",INDEX(Risk_Factors!$O$26:$T$28,MATCH('1_Risk_Calc'!K81,Dust_size,0),MATCH($E81,Risk_Factors!$O$8:$T$8,0)))","v":""},{"$f":"IF(L81=0,\"\",INDEX(Risk_Factors!$O$29:$T$30,MATCH('1_Risk_Calc'!L81,Risk_Factors!$E$29:$E$30,0),MATCH($E81,Risk_Factors!$O$8:$T$8,0)))","v":""},{"$f":"IF(M81=0,\"\",INDEX(Risk_Factors!$O$32:$T$33,MATCH('1_Risk_Calc'!M81,Risk_Factors!$E$32:$E$33,0),MATCH($E81,Risk_Factors!$O$8:$T$8,0)))","v":""},{"$f":"IF(N81=0,\"\",INDEX(Risk_Factors!$O$35:$T$36,MATCH('1_Risk_Calc'!N81,Risk_Factors!$E$35:$E$36,0),MATCH($E81,Risk_Factors!$O$8:$T$8,0)))","v":""},{"$f":"IF(O81=0,\"\",INDEX(Risk_Factors!$O$38:$T$39,MATCH('1_Risk_Calc'!O81,Risk_Factors!$E$38:$E$39,0),MATCH($E81,Risk_Factors!$O$8:$T$8,0)))","v":""},{"$f":"IF(P81=0,\"\",INDEX(Risk_Factors!$O$41:$T$42,MATCH('1_Risk_Calc'!P81,Risk_Factors!$E$41:$E$42,0),MATCH($E81,Risk_Factors!$O$8:$T$8,0)))","v":""},0,0,null,null,null,"S_072",0]
[null,"S_073",null,null,null,null,null,null,null,null,null,null,null,null,null,null,{"$f":"IF(F82=0,\"\",INDEX(Risk_Factors!$O$12:$T$14,MATCH(F82,Frequency,0),MATCH($E82,Risk_Factors!$O$8:$T$8,0)))","v":""},{"$f":"IF(G82=0,\"\",INDEX(Risk_Factors!$O$15:$T$17,MATCH('1_Risk_Calc'!G82,Position,0),MATCH($E82,Risk_Factors!$O$8:$T$8,0)))","v":""},{"$f":"IF(H82=0,\"\",INDEX(Risk_Factors!$O$18:$T$19,MATCH('1_Risk_Calc'!H82,Yes_No,0),MATCH($E82,Risk_Factors!$O$8:$T$8,0)))","v":""},{"$f":"IF(I82=0,\"\",INDEX(Risk_Factors!$O$20:$T$22,MATCH('1_Risk_Calc'!I82,Dust_amount,0),MATCH($E82,Risk_Factors!$O$8:$T$8,0)))","v":""},{"$f":"IF(J82=0,\"\",INDEX(Risk_Factors!$O$23:$T$25,MATCH('1_Risk_Calc'!J82,Dust_composition,0),MATCH($E82,Risk_Factors!$O$8:$T$8,0)))","v":""},{"$f":"IF(K82=0,\"\",INDEX(Risk_Factors!$O$26:$T$28,MATCH('1_Risk_Calc'!K82,Dust_size,0),MATCH($E82,Risk_Factors!$O$8:$T$8,0)))","v":""},{"$f":"IF(L82=0,\"\",INDEX(Risk_Factors!$O$29:$T$30,MATCH('1_Risk_Calc'!L82,Risk_Factors!$E$29:$E$30,0),MATCH($E82,Risk_Factors!$O$8:$T$8,0)))","v":""},{"$f":"IF(M82=0,\"\",INDEX(Risk_Factors!$O$32:$T$33,MATCH('1_Risk_Calc'!M82,Risk_Factors!$E$32:$E$33,0),MATCH($E82,Risk_Factors!$O$8:$T$8,0)))","v":""},{"$f":"IF(N82=0,\"\",INDEX(Risk_Factors!$O$35:$T$36,MATCH('1_Risk_Calc'!N82,Risk_Factors!$E$35:$E$36,0),MATCH($E82,Risk_Factors!$O$8:$T$8,0)))","v":""},{"$f":"IF(O82=0,\"\",INDEX(Risk_Factors!$O$38:$T$39,MATCH('1_Risk_Calc'!O82,Risk_Factors!$E$38:$E$39,0),MATCH($E82,Risk_Factors!$O$8:$T$8,0)))","v":""},{"$f":"IF(P82=0,\"\",INDEX(Risk_Factors!$O$41:$T$42,MATCH('1_Risk_Calc'!P82,Risk_Factors!$E$41:$E$42,0),MATCH($E82,Risk_Factors!$O$8:$T$8,0)))","v":""},0,0,null,null,null,"S_073",0]
[null,"S_074",null,null,null,null,null,null,null,null,null,null,null,null,null,null,{"$f":"IF(F83=0,\"\",INDEX(Risk_Factors!$O$12:$T$14,MATCH(F83,Frequency,0),MATCH($E83,Risk_Factors!$O$8:$T$8,0)))","v":""},{"$f":"IF(G83=0,\"\",INDEX(Risk_Factors!$O$15:$T$17,MATCH('1_Risk_Calc'!G83,Position,0),MATCH($E83,Risk_Factors!$O$8:$T$8,0)))","v":""},{"$f":"IF(H83=0,\"\",INDEX(Risk_Factors!$O$18:$T$19,MATCH('1_Risk_Calc'!H83,Yes_No,0),MATCH($E83,Risk_Factors!$O$8:$T$8,0)))","v":""},{"$f":"IF(I83=0,\"\",INDEX(Risk_Factors!$O$20:$T$22,MATCH('1_Risk_Calc'!I83,Dust_amount,0),MATCH($E83,Risk_Factors!$O$8:$T$8,0)))","v":""},{"$f":"IF(J83=0,\"\",INDEX(Risk_Factors!$O$23:$T$25,MATCH('1_Risk_Calc'!J83,Dust_composition,0),MATCH($E83,Risk_Factors!$O$8:$T$8,0)))","v":""},{"$f":"IF(K83=0,\"\",INDEX(Risk_Factors!$O$26:$T$28,MATCH('1_Risk_Calc'!K83,Dust_size,0),MATCH($E83,Risk_Factors!$O$8:$T$8,0)))","v":""},{"$f":"IF(L83=0,\"\",INDEX(Risk_Factors!$O$29:$T$30,MATCH('1_Risk_Calc'!L83,Risk_Factors!$E$29:$E$30,0),MATCH($E83,Risk_Factors!$O$8:$T$8,0)))","v":""},{"$f":"IF(M83=0,\"\",INDEX(Risk_Factors!$O$32:$T$33,MATCH('1_Risk_Calc'!M83,Risk_Factors!$E$32:$E$33,0),MATCH($E83,Risk_Factors!$O$8:$T$8,0)))","v":""},{"$f":"IF(N83=0,\"\",INDEX(Risk_Factors!$O$35:$T$36,MATCH('1_Risk_Calc'!N83,Risk_Factors!$E$35:$E$36,0),MATCH($E83,Risk_Factors!$O$8:$T$8,0)))","v":""},{"$f":"IF(O83=0,\"\",INDEX(Risk_Factors!$O$38:$T$39,MATCH('1_Risk_Calc'!O83,Risk_Factors!$E$38:$E$39,0),MATCH($E83,Risk_Factors!$O$8:$T$8,0)))","v":""},{"$f":"IF(P83=0,\"\",INDEX(Risk_Factors!$O$41:$T$42,MATCH('1_Risk_Calc'!P83,Risk_Factors!$E$41:$E$42,0),MATCH($E83,Risk_Factors!$O$8:$T$8,0)))","v":""},0,0,null,null,null,"S_074",0]
[null,"S_075",null,null,null,null,null,null,null,null,null,null,null,null,null,null,{"$f":"IF(F84=0,\"\",INDEX(Risk_Factors!$O$12:$T$14,MATCH(F84,Frequency,0),MATCH($E84,Risk_Factors!$O$8:$T$8,0)))","v":""},{"$f":"IF(G84=0,\"\",INDEX(Risk_Factors!$O$15:$T$17,MATCH('1_Risk_Calc'!G84,Position,0),MATCH($E84,Risk_Factors!$O$8:$T$8,0)))","v":""},{"$f":"IF(H84=0,\"\",INDEX(Risk_Factors!$O$18:$T$19,MATCH('1_Risk_Calc'!H84,Yes_No,0),MATCH($E84,Risk_Factors!$O$8:$T$8,0)))","v":""},{"$f":"IF(I84=0,\"\",INDEX(Risk_Factors!$O$20:$T$22,MATCH('1_Risk_Calc'!I84,Dust_amount,0),MATCH($E84,Risk_Factors!$O$8:$T$8,0)))","v":""},{"$f":"IF(J84=0,\"\",INDEX(Risk_Factors!$O$23:$T$25,MATCH('1_Risk_Calc'!J84,Dust_composition,0),MATCH($E84,Risk_Factors!$O$8:$T$8,0)))","v":""},{"$f":"IF(K84=0,\"\",INDEX(Risk_Factors!$O$26:$T$28,MATCH('1_Risk_Calc'!K84,Dust_size,0),MATCH($E84,Risk_Factors!$O$8:$T$8,0)))","v":""},{"$f":"IF(L84=0,\"\",INDEX(Risk_Factors!$O$29:$T$30,MATCH('1_Risk_Calc'!L84,Risk_Factors!$E$29:$E$30,0),MATCH($E84,Risk_Factors!$O$8:$T$8,0)))","v":""},{"$f":"IF(M84=0,\"\",INDEX(Risk_Factors!$O$32:$T$33,MATCH('1_Risk_Calc'!M84,Risk_Factors!$E$32:$E$33,0),MATCH($E84,Risk_Factors!$O$8:$T$8,0)))","v":""},{"$f":"IF(N84=0,\"\",INDEX(Risk_Factors!$O$35:$T$36,MATCH('1_Risk_Calc'!N84,Risk_Factors!$E$35:$E$36,0),MATCH($E84,Risk_Factors!$O$8:$T$8,0)))","v":""},{"$f":"IF(O84=0,\"\",INDEX(Risk_Factors!$O$38:$T$39,MATCH('1_Risk_Calc'!O84,Risk_Factors!$E$38:$E$39,0),MATCH($E84,Risk_Factors!$O$8:$T$8,0)))","v":""},{"$f":"IF(P84=0,\"\",INDEX(Risk_Factors!$O$41:$T$42,MATCH('1_Risk_Calc'!P84,Risk_Factors!$E$41:$E$42,0),MATCH($E84,Risk_Factors!$O$8:$T$8,0)))","v":""},0,0,null,null,null,"S_075",0]
[null,"S_076",null,null,null,null,null,null,null,null,null,null,null,null,null,null,{"$f":"IF(F85=0,\"\",INDEX(Risk_Factors!$O$12:$T$14,MATCH(F85,Frequency,0),MATCH($E85,Risk_Factors!$O$8:$T$8,0)))","v":""},{"$f":"IF(G85=0,\"\",INDEX(Risk_Factors!$O$15:$T$17,MATCH('1_Risk_Calc'!G85,Position,0),MATCH($E85,Risk_Factors!$O$8:$T$8,0)))","v":""},{"$f":"IF(H85=0,\"\",INDEX(Risk_Factors!$O$18:$T$19,MATCH('1_Risk_Calc'!H85,Yes_No,0),MATCH($E85,Risk_Factors!$O$8:$T$8,0)))","v":""},{"$f":"IF(I85=0,\"\",INDEX(Risk_Factors!$O$20:$T$22,MATCH('1_Risk_Calc'!I85,Dust_amount,0),MATCH($E85,Risk_Factors!$O$8:$T$8,0)))","v":""},{"$f":"IF(J85=0,\"\",INDEX(Risk_Factors!$O$23:$T$25,MATCH('1_Risk_Calc'!J85,Dust_composition,0),MATCH($E85,Risk_Factors!$O$8:$T$8,0)))","v":""},{"$f":"IF(K85=0,\"\",INDEX(Risk_Factors!$O$26:$T$28,MATCH('1_Risk_Calc'!K85,Dust_size,0),MATCH($E85,Risk_Factors!$O$8:$T$8,0)))","v":""},{"$f":"IF(L85=0,\"\",INDEX(Risk_Factors!$O$29:$T$30,MATCH('1_Risk_Calc'!L85,Risk_Factors!$E$29:$E$30,0),MATCH($E85,Risk_Factors!$O$8:$T$8,0)))","v":""},{"$f":"IF(M85=0,\"\",INDEX(Risk_Factors!$O$32:$T$33,MATCH('1_Risk_Calc'!M85,Risk_Factors!$E$32:$E$33,0),MATCH($E85,Risk_Factors!$O$8:$T$8,0)))","v":""},{"$f":"IF(N85=0,\"\",INDEX(Risk_Factors!$O$35:$T$36,MATCH('1_Risk_Calc'!N85,Risk_Factors!$E$35:$E$36,0),MATCH($E85,Risk_Factors!$O$8:$T$8,0)))","v":""},{"$f":"IF(O85=0,\"\",INDEX(Risk_Factors!$O$38:$T$39,MATCH('1_Risk_Calc'!O85,Risk_Factors!$E$38:$E$39,0),MATCH($E85,Risk_Factors!$O$8:$T$8,0)))","v":""},{"$f":"IF(P85=0,\"\",INDEX(Risk_Factors!$O$41:$T$42,MATCH('1_Risk_Calc'!P85,Risk_Factors!$E$41:$E$42,0),MATCH($E85,Risk_Factors!$O$8:$T$8,0)))","v":""},0,0,null,null,null,"S_076",0]
[null,"S_077",null,null,null,null,null,null,null,null,null,null,null,null,null,null,{"$f":"IF(F86=0,\"\",INDEX(Risk_Factors!$O$12:$T$14,MATCH(F86,Frequency,0),MATCH($E86,Risk_Factors!$O$8:$T$8,0)))","v":""},{"$f":"IF(G86=0,\"\",INDEX(Risk_Factors!$O$15:$T$17,MATCH('1_Risk_Calc'!G86,Position,0),MATCH($E86,Risk_Factors!$O$8:$T$8,0)))","v":""},{"$f":"IF(H86=0,\"\",INDEX(Risk_Factors!$O$18:$T$19,MATCH('1_Risk_Calc'!H86,Yes_No,0),MATCH($E86,Risk_Factors!$O$8:$T$8,0)))","v":""},{"$f":"IF(I86=0,\"\",INDEX(Risk_Factors!$O$20:$T$22,MATCH('1_Risk_Calc'!I86,Dust_amount,0),MATCH($E86,Risk_Factors!$O$8:$T$8,0)))","v":""},{"$f":"IF(J86=0,\"\",INDEX(Risk_Factors!$O$23:$T$25,MATCH('1_Risk_Calc'!J86,Dust_composition,0),MATCH($E86,Risk_Factors!$O$8:$T$8,0)))","v":""},{"$f":"IF(K86=0,\"\",INDEX(Risk_Factors!$O$26:$T$28,MATCH('1_Risk_Calc'!K86,Dust_size,0),MATCH($E86,Risk_Factors!$O$8:$T$8,0)))","v":""},{"$f":"IF(L86=0,\"\",INDEX(Risk_Factors!$O$29:$T$30,MATCH('1_Risk_Calc'!L86,Risk_Factors!$E$29:$E$30,0),MATCH($E86,Risk_Factors!$O$8:$T$8,0)))","v":""},{"$f":"IF(M86=0,\"\",INDEX(Risk_Factors!$O$32:$T$33,MATCH('1_Risk_Calc'!M86,Risk_Factors!$E$32:$E$33,0),MATCH($E86,Risk_Factors!$O$8:$T$8,0)))","v":""},{"$f":"IF(N86=0,\"\",INDEX(Risk_Factors!$O$35:$T$36,MATCH('1_Risk_Calc'!N86,Risk_Factors!$E$35:$E$36,0),MATCH($E86,Risk_Factors!$O$8:$T$8,0)))","v":""},{"$f":"IF(O86=0,\"\",INDEX(Risk_Factors!$O$38:$T$39,MATCH('1_Risk_Calc'!O86,Risk_Factors!$E$38:$E$39,0),MATCH($E86,Risk_Factors!$O$8:$T$8,0)))","v":""},{"$f":"IF(P86=0,\"\",INDEX(Risk_Factors!$O$41:$T$42,MATCH('1_Risk_Calc'!P86,Risk_Factors!$E$41:$E$42,0),MATCH($E86,Risk_Factors!$O$8:$T$8,0)))","v":""},0,0,null,null,null,"S_077",0]
[null,"S_078",null,null,null,null,null,null,null,null,null,null,null,null,null,null,{"$f":"IF(F87=0,\"\",INDEX(Risk_Factors!$O$12:$T$14,MATCH(F87,Frequency,0),MATCH($E87,Risk_Factors!$O$8:$T$8,0)))","v":""},{"$f":"IF(G87=0,\"\",INDEX(Risk_Factors!$O$15:$T$17,MATCH('1_Risk_Calc'!G87,Position,0),MATCH($E87,Risk_Factors!$O$8:$T$8,0)))","v":""},{"$f":"IF(H87=0,\"\",INDEX(Risk_Factors!$O$18:$T$19,MATCH('1_Risk_Calc'!H87,Yes_No,0),MATCH($E87,Risk_Factors!$O$8:$T$8,0)))","v":""},{"$f":"IF(I87=0,\"\",INDEX(Risk_Factors!$O$20:$T$22,MATCH('1_Risk_Calc'!I87,Dust_amount,0),MATCH($E87,Risk_Factors!$O$8:$T$8,0)))","v":""},{"$f":"IF(J87=0,\"\",INDEX(Risk_Factors!$O$23:$T$25,MATCH('1_Risk_Calc'!J87,Dust_composition,0),MATCH($E87,Risk_Factors!$O$8:$T$8,0)))","v":""},{"$f":"IF(K87=0,\"\",INDEX(Risk_Factors!$O$26:$T$28,MATCH('1_Risk_Calc'!K87,Dust_size,0),MATCH($E87,Risk_Factors!$O$8:$T$8,0)))","v":""},{"$f":"IF(L87=0,\"\",INDEX(Risk_Factors!$O$29:$T$30,MATCH('1_Risk_Calc'!L87,Risk_Factors!$E$29:$E$30,0),MATCH($E87,Risk_Factors!$O$8:$T$8,0)))","v":""},{"$f":"IF(M87=0,\"\",INDEX(Risk_Factors!$O$32:$T$33,MATCH('1_Risk_Calc'!M87,Risk_Factors!$E$32:$E$33,0),MATCH($E87,Risk_Factors!$O$8:$T$8,0)))","v":""},{"$f":"IF(N87=0,\"\",INDEX(Risk_Factors!$O$35:$T$36,MATCH('1_Risk_Calc'!N87,Risk_Factors!$E$35:$E$36,0),MATCH($E87,Risk_Factors!$O$8:$T$8,0)))","v":""},{"$f":"IF(O87=0,\"\",INDEX(Risk_Factors!$O$38:$T$39,MATCH('1_Risk_Calc'!O87,Risk_Factors!$E$38:$E$39,0),MATCH($E87,Risk_Factors!$O$8:$T$8,0)))","v":""},{"$f":"IF(P87=0,\"\",INDEX(Risk_Factors!$O$41:$T$42,MATCH('1_Risk_Calc'!P87,Risk_Factors!$E$41:$E$42,0),MATCH($E87,Risk_Factors!$O$8:$T$8,0)))","v":""},0,0,null,null,null,"S_078",0]
[null,"S_079",null,null,null,null,null,null,null,null,null,null,null,null,null,null,{"$f":"IF(F88=0,\"\",INDEX(Risk_Factors!$O$12:$T$14,MATCH(F88,Frequency,0),MATCH($E88,Risk_Factors!$O$8:$T$8,0)))","v":""},{"$f":"IF(G88=0,\"\",INDEX(Risk_Factors!$O$15:$T$17,MATCH('1_Risk_Calc'!G88,Position,0),MATCH($E88,Risk_Factors!$O$8:$T$8,0)))","v":""},{"$f":"IF(H88=0,\"\",INDEX(Risk_Factors!$O$18:$T$19,MATCH('1_Risk_Calc'!H88,Yes_No,0),MATCH($E88,Risk_Factors!$O$8:$T$8,0)))","v":""},{"$f":"IF(I88=0,\"\",INDEX(Risk_Factors!$O$20:$T$22,MATCH('1_Risk_Calc'!I88,Dust_amount,0),MATCH($E88,Risk_Factors!$O$8:$T$8,0)))","v":""},{"$f":"IF(J88=0,\"\",INDEX(Risk_Factors!$O$23:$T$25,MATCH('1_Risk_Calc'!J88,Dust_composition,0),MATCH($E88,Risk_Factors!$O$8:$T$8,0)))","v":""},{"$f":"IF(K88=0,\"\",INDEX(Risk_Factors!$O$26:$T$28,MATCH('1_Risk_Calc'!K88,Dust_size,0),MATCH($E88,Risk_Factors!$O$8:$T$8,0)))","v":""},{"$f":"IF(L88=0,\"\",INDEX(Risk_Factors!$O$29:$T$30,MATCH('1_Risk_Calc'!L88,Risk_Factors!$E$29:$E$30,0),MATCH($E88,Risk_Factors!$O$8:$T$8,0)))","v":""},{"$f":"IF(M88=0,\"\",INDEX(Risk_Factors!$O$32:$T$33,MATCH('1_Risk_Calc'!M88,Risk_Factors!$E$32:$E$33,0),MATCH($E88,Risk_Factors!$O$8:$T$8,0)))","v":""},{"$f":"IF(N88=0,\"\",INDEX(Risk_Factors!$O$35:$T$36,MATCH('1_Risk_Calc'!N88,Risk_Factors!$E$35:$E$36,0),MATCH($E88,Risk_Factors!$O$8:$T$8,0)))","v":""},{"$f":"IF(O88=0,\"\",INDEX(Risk_Factors!$O$38:$T$39,MATCH('1_Risk_Calc'!O88,Risk_Factors!$E$38:$E$39,0),MATCH($E88,Risk_Factors!$O$8:$T$8,0)))","v":""},{"$f":"IF(P88=0,\"\",INDEX(Risk_Factors!$O$41:$T$42,MATCH('1_Risk_Calc'!P88,Risk_Factors!$E$41:$E$42,0),MATCH($E88,Risk_Factors!$O$8:$T$8,0)))","v":""},0,0,null,null,null,"S_079",0]
[null,"S_080",null,null,null,null,null,null,null,null,null,null,null,null,null,null,{"$f":"IF(F89=0,\"\",INDEX(Risk_Factors!$O$12:$T$14,MATCH(F89,Frequency,0),MATCH($E89,Risk_Factors!$O$8:$T$8,0)))","v":""},{"$f":"IF(G89=0,\"\",INDEX(Risk_Factors!$O$15:$T$17,MATCH('1_Risk_Calc'!G89,Position,0),MATCH($E89,Risk_Factors!$O$8:$T$8,0)))","v":""},{"$f":"IF(H89=0,\"\",INDEX(Risk_Factors!$O$18:$T$19,MATCH('1_Risk_Calc'!H89,Yes_No,0),MATCH($E89,Risk_Factors!$O$8:$T$8,0)))","v":""},{"$f":"IF(I89=0,\"\",INDEX(Risk_Factors!$O$20:$T$22,MATCH('1_Risk_Calc'!I89,Dust_amount,0),MATCH($E89,Risk_Factors!$O$8:$T$8,0)))","v":""},{"$f":"IF(J89=0,\"\",INDEX(Risk_Factors!$O$23:$T$25,MATCH('1_Risk_Calc'!J89,Dust_composition,0),MATCH($E89,Risk_Factors!$O$8:$T$8,0)))","v":""},{"$f":"IF(K89=0,\"\",INDEX(Risk_Factors!$O$26:$T$28,MATCH('1_Risk_Calc'!K89,Dust_size,0),MATCH($E89,Risk_Factors!$O$8:$T$8,0)))","v":""},{"$f":"IF(L89=0,\"\",INDEX(Risk_Factors!$O$29:$T$30,MATCH('1_Risk_Calc'!L89,Risk_Factors!$E$29:$E$30,0),MATCH($E89,Risk_Factors!$O$8:$T$8,0)))","v":""},{"$f":"IF(M89=0,\"\",INDEX(Risk_Factors!$O$32:$T$33,MATCH('1_Risk_Calc'!M89,Risk_Factors!$E$32:$E$33,0),MATCH($E89,Risk_Factors!$O$8:$T$8,0)))","v":""},{"$f":"IF(N89=0,\"\",INDEX(Risk_Factors!$O$35:$T$36,MATCH('1_Risk_Calc'!N89,Risk_Factors!$E$35:$E$36,0),MATCH($E89,Risk_Factors!$O$8:$T$8,0)))","v":""},{"$f":"IF(O89=0,\"\",INDEX(Risk_Factors!$O$38:$T$39,MATCH('1_Risk_Calc'!O89,Risk_Factors!$E$38:$E$39,0),MATCH($E89,Risk_Factors!$O$8:$T$8,0)))","v":""},{"$f":"IF(P89=0,\"\",INDEX(Risk_Factors!$O$41:$T$42,MATCH('1_Risk_Calc'!P89,Risk_Factors!$E$41:$E$42,0),MATCH($E89,Risk_Factors!$O$8:$T$8,0)))","v":""},0,0,null,null,null,"S_080",0]
[null,"S_081",null,null,null,null,null,null,null,null,null,null,null,null,null,null,{"$f":"IF(F90=0,\"\",INDEX(Risk_Factors!$O$12:$T$14,MATCH(F90,Frequency,0),MATCH($E90,Risk_Factors!$O$8:$T$8,0)))","v":""},{"$f":"IF(G90=0,\"\",INDEX(Risk_Factors!$O$15:$T$17,MATCH('1_Risk_Calc'!G90,Position,0),MATCH($E90,Risk_Factors!$O$8:$T$8,0)))","v":""},{"$f":"IF(H90=0,\"\",INDEX(Risk_Factors!$O$18:$T$19,MATCH('1_Risk_Calc'!H90,Yes_No,0),MATCH($E90,Risk_Factors!$O$8:$T$8,0)))","v":""},{"$f":"IF(I90=0,\"\",INDEX(Risk_Factors!$O$20:$T$22,MATCH('1_Risk_Calc'!I90,Dust_amount,0),MATCH($E90,Risk_Factors!$O$8:$T$8,0)))","v":""},{"$f":"IF(J90=0,\"\",INDEX(Risk_Factors!$O$23:$T$25,MATCH('1_Risk_Calc'!J90,Dust_composition,0),MATCH($E90,Risk_Factors!$O$8:$T$8,0)))","v":""},{"$f":"IF(K90=0,\"\",INDEX(Risk_Factors!$O$26:$T$28,MATCH('1_Risk_Calc'!K90,Dust_size,0),MATCH($E90,Risk_Factors!$O$8:$T$8,0)))","v":""},{"$f":"IF(L90=0,\"\",INDEX(Risk_Factors!$O$29:$T$30,MATCH('1_Risk_Calc'!L90,Risk_Factors!$E$29:$E$30,0),MATCH($E90,Risk_Factors!$O$8:$T$8,0)))","v":""},{"$f":"IF(M90=0,\"\",INDEX(Risk_Factors!$O$32:$T$33,MATCH('1_Risk_Calc'!M90,Risk_Factors!$E$32:$E$33,0),MATCH($E90,Risk_Factors!$O$8:$T$8,0)))","v":""},{"$f":"IF(N90=0,\"\",INDEX(Risk_Factors!$O$35:$T$36,MATCH('1_Risk_Calc'!N90,Risk_Factors!$E$35:$E$36,0),MATCH($E90,Risk_Factors!$O$8:$T$8,0)))","v":""},{"$f":"IF(O90=0,\"\",INDEX(Risk_Factors!$O$38:$T$39,MATCH('1_Risk_Calc'!O90,Risk_Factors!$E$38:$E$39,0),MATCH($E90,Risk_Factors!$O$8:$T$8,0)))","v":""},{"$f":"IF(P90=0,\"\",INDEX(Risk_Factors!$O$41:$T$42,MATCH('1_Risk_Calc'!P90,Risk_Factors!$E$41:$E$42,0),MATCH($E90,Risk_Factors!$O$8:$T$8,0)))","v":""},0,0,null,null,null,"S_081",0]
[null,"S_082",null,null,null,null,null,null,null,null,null,null,null,null,null,null,{"$f":"IF(F91=0,\"\",INDEX(Risk_Factors!$O$12:$T$14,MATCH(F91,Frequency,0),MATCH($E91,Risk_Factors!$O$8:$T$8,0)))","v":""},{"$f":"IF(G91=0,\"\",INDEX(Risk_Factors!$O$15:$T$17,MATCH('1_Risk_Calc'!G91,Position,0),MATCH($E91,Risk_Factors!$O$8:$T$8,0)))","v":""},{"$f":"IF(H91=0,\"\",INDEX(Risk_Factors!$O$18:$T$19,MATCH('1_Risk_Calc'!H91,Yes_No,0),MATCH($E91,Risk_Factors!$O$8:$T$8,0)))","v":""},{"$f":"IF(I91=0,\"\",INDEX(Risk_Factors!$O$20:$T$22,MATCH('1_Risk_Calc'!I91,Dust_amount,0),MATCH($E91,Risk_Factors!$O$8:$T$8,0)))","v":""},{"$f":"IF(J91=0,\"\",INDEX(Risk_Factors!$O$23:$T$25,MATCH('1_Risk_Calc'!J91,Dust_composition,0),MATCH($E91,Risk_Factors!$O$8:$T$8,0)))","v":""},{"$f":"IF(K91=0,\"\",INDEX(Risk_Factors!$O$26:$T$28,MATCH('1_Risk_Calc'!K91,Dust_size,0),MATCH($E91,Risk_Factors!$O$8:$T$8,0)))","v":""},{"$f":"IF(L91=0,\"\",INDEX(Risk_Factors!$O$29:$T$30,MATCH('1_Risk_Calc'!L91,Risk_Factors!$E$29:$E$30,0),MATCH($E91,Risk_Factors!$O$8:$T$8,0)))","v":""},{"$f":"IF(M91=0,\"\",INDEX(Risk_Factors!$O$32:$T$33,MATCH('1_Risk_Calc'!M91,Risk_Factors!$E$32:$E$33,0),MATCH($E91,Risk_Factors!$O$8:$T$8,0)))","v":""},{"$f":"IF(N91=0,\"\",INDEX(Risk_Factors!$O$35:$T$36,MATCH('1_Risk_Calc'!N91,Risk_Factors!$E$35:$E$36,0),MATCH($E91,Risk_Factors!$O$8:$T$8,0)))","v":""},{"$f":"IF(O91=0,\"\",INDEX(Risk_Factors!$O$38:$T$39,MATCH('1_Risk_Calc'!O91,Risk_Factors!$E$38:$E$39,0),MATCH($E91,Risk_Factors!$O$8:$T$8,0)))","v":""},{"$f":"IF(P91=0,\"\",INDEX(Risk_Factors!$O$41:$T$42,MATCH('1_Risk_Calc'!P91,Risk_Factors!$E$41:$E$42,0),MATCH($E91,Risk_Factors!$O$8:$T$8,0)))","v":""},0,0,null,null,null,"S_082",0]
[null,"S_083",null,null,null,null,null,null,null,null,null,null,null,null,null,null,{"$f":"IF(F92=0,\"\",INDEX(Risk_Factors!$O$12:$T$14,MATCH(F92,Frequency,0),MATCH($E92,Risk_Factors!$O$8:$T$8,0)))","v":""},{"$f":"IF(G92=0,\"\",INDEX(Risk_Factors!$O$15:$T$17,MATCH('1_Risk_Calc'!G92,Position,0),MATCH($E92,Risk_Factors!$O$8:$T$8,0)))","v":""},{"$f":"IF(H92=0,\"\",INDEX(Risk_Factors!$O$18:$T$19,MATCH('1_Risk_Calc'!H92,Yes_No,0),MATCH($E92,Risk_Factors!$O$8:$T$8,0)))","v":""},{"$f":"IF(I92=0,\"\",INDEX(Risk_Factors!$O$20:$T$22,MATCH('1_Risk_Calc'!I92,Dust_amount,0),MATCH($E92,Risk_Factors!$O$8:$T$8,0)))","v":""},{"$f":"IF(J92=0,\"\",INDEX(Risk_Factors!$O$23:$T$25,MATCH('1_Risk_Calc'!J92,Dust_composition,0),MATCH($E92,Risk_Factors!$O$8:$T$8,0)))","v":""},{"$f":"IF(K92=0,\"\",INDEX(Risk_Factors!$O$26:$T$28,MATCH('1_Risk_Calc'!K92,Dust_size,0),MATCH($E92,Risk_Factors!$O$8:$T$8,0)))","v":""},{"$f":"IF(L92=0,\"\",INDEX(Risk_Factors!$O$29:$T$30,MATCH('1_Risk_Calc'!L92,Risk_Factors!$E$29:$E$30,0),MATCH($E92,Risk_Factors!$O$8:$T$8,0)))","v":""},{"$f":"IF(M92=0,\"\",INDEX(Risk_Factors!$O$32:$T$33,MATCH('1_Risk_Calc'!M92,Risk_Factors!$E$32:$E$33,0),MATCH($E92,Risk_Factors!$O$8:$T$8,0)))","v":""},{"$f":"IF(N92=0,\"\",INDEX(Risk_Factors!$O$35:$T$36,MATCH('1_Risk_Calc'!N92,Risk_Factors!$E$35:$E$36,0),MATCH($E92,Risk_Factors!$O$8:$T$8,0)))","v":""},{"$f":"IF(O92=0,\"\",INDEX(Risk_Factors!$O$38:$T$39,MATCH('1_Risk_Calc'!O92,Risk_Factors!$E$38:$E$39,0),MATCH($E92,Risk_Factors!$O$8:$T$8,0)))","v":""},{"$f":"IF(P92=0,\"\",INDEX(Risk_Factors!$O$41:$T$42,MATCH('1_Risk_Calc'!P92,Risk_Factors!$E$41:$E$42,0),MATCH($E92,Risk_Factors!$O$8:$T$8,0)))","v":""},0,0,null,null,null,"S_083",0]
[null,"S_084",null,null,null,null,null,null,null,null,null,null,null,null,null,null,{"$f":"IF(F93=0,\"\",INDEX(Risk_Factors!$O$12:$T$14,MATCH(F93,Frequency,0),MATCH($E93,Risk_Factors!$O$8:$T$8,0)))","v":""},{"$f":"IF(G93=0,\"\",INDEX(Risk_Factors!$O$15:$T$17,MATCH('1_Risk_Calc'!G93,Position,0),MATCH($E93,Risk_Factors!$O$8:$T$8,0)))","v":""},{"$f":"IF(H93=0,\"\",INDEX(Risk_Factors!$O$18:$T$19,MATCH('1_Risk_Calc'!H93,Yes_No,0),MATCH($E93,Risk_Factors!$O$8:$T$8,0)))","v":""},{"$f":"IF(I93=0,\"\",INDEX(Risk_Factors!$O$20:$T$22,MATCH('1_Risk_Calc'!I93,Dust_amount,0),MATCH($E93,Risk_Factors!$O$8:$T$8,0)))","v":""},{"$f":"IF(J93=0,\"\",INDEX(Risk_Factors!$O$23:$T$25,MATCH('1_Risk_Calc'!J93,Dust_composition,0),MATCH($E93,Risk_Factors!$O$8:$T$8,0)))","v":""},{"$f":"IF(K93=0,\"\",INDEX(Risk_Factors!$O$26:$T$28,MATCH('1_Risk_Calc'!K93,Dust_size,0),MATCH($E93,Risk_Factors!$O$8:$T$8,0)))","v":""},{"$f":"IF(L93=0,\"\",INDEX(Risk_Factors!$O$29:$T$30,MATCH('1_Risk_Calc'!L93,Risk_Factors!$E$29:$E$30,0),MATCH($E93,Risk_Factors!$O$8:$T$8,0)))","v":""},{"$f":"IF(M93=0,\"\",INDEX(Risk_Factors!$O$32:$T$33,MATCH('1_Risk_Calc'!M93,Risk_Factors!$E$32:$E$33,0),MATCH($E93,Risk_Factors!$O$8:$T$8,0)))","v":""},{"$f":"IF(N93=0,\"\",INDEX(Risk_Factors!$O$35:$T$36,MATCH('1_Risk_Calc'!N93,Risk_Factors!$E$35:$E$36,0),MATCH($E93,Risk_Factors!$O$8:$T$8,0)))","v":""},{"$f":"IF(O93=0,\"\",INDEX(Risk_Factors!$O$38:$T$39,MATCH('1_Risk_Calc'!O93,Risk_Factors!$E$38:$E$39,0),MATCH($E93,Risk_Factors!$O$8:$T$8,0)))","v":""},{"$f":"IF(P93=0,\"\",INDEX(Risk_Factors!$O$41:$T$42,MATCH('1_Risk_Calc'!P93,Risk_Factors!$E$41:$E$42,0),MATCH($E93,Risk_Factors!$O$8:$T$8,0)))","v":""},0,0,null,null,null,"S_084",0]
[null,"S_085",null,null,null,null,null,null,null,null,null,null,null,null,null,null,{"$f":"IF(F94=0,\"\",INDEX(Risk_Factors!$O$12:$T$14,MATCH(F94,Frequency,0),MATCH($E94,Risk_Factors!$O$8:$T$8,0)))","v":""},{"$f":"IF(G94=0,\"\",INDEX(Risk_Factors!$O$15:$T$17,MATCH('1_Risk_Calc'!G94,Position,0),MATCH($E94,Risk_Factors!$O$8:$T$8,0)))","v":""},{"$f":"IF(H94=0,\"\",INDEX(Risk_Factors!$O$18:$T$19,MATCH('1_Risk_Calc'!H94,Yes_No,0),MATCH($E94,Risk_Factors!$O$8:$T$8,0)))","v":""},{"$f":"IF(I94=0,\"\",INDEX(Risk_Factors!$O$20:$T$22,MATCH('1_Risk_Calc'!I94,Dust_amount,0),MATCH($E94,Risk_Factors!$O$8:$T$8,0)))","v":""},{"$f":"IF(J94=0,\"\",INDEX(Risk_Factors!$O$23:$T$25,MATCH('1_Risk_Calc'!J94,Dust_composition,0),MATCH($E94,Risk_Factors!$O$8:$T$8,0)))","v":""},{"$f":"IF(K94=0,\"\",INDEX(Risk_Factors!$O$26:$T$28,MATCH('1_Risk_Calc'!K94,Dust_size,0),MATCH($E94,Risk_Factors!$O$8:$T$8,0)))","v":""},{"$f":"IF(L94=0,\"\",INDEX(Risk_Factors!$O$29:$T$30,MATCH('1_Risk_Calc'!L94,Risk_Factors!$E$29:$E$30,0),MATCH($E94,Risk_Factors!$O$8:$T$8,0)))","v":""},{"$f":"IF(M94=0,\"\",INDEX(Risk_Factors!$O$32:$T$33,MATCH('1_Risk_Calc'!M94,Risk_Factors!$E$32:$E$33,0),MATCH($E94,Risk_Factors!$O$8:$T$8,0)))","v":""},{"$f":"IF(N94=0,\"\",INDEX(Risk_Factors!$O$35:$T$36,MATCH('1_Risk_Calc'!N94,Risk_Factors!$E$35:$E$36,0),MATCH($E94,Risk_Factors!$O$8:$T$8,0)))","v":""},{"$f":"IF(O94=0,\"\",INDEX(Risk_Factors!$O$38:$T$39,MATCH('1_Risk_Calc'!O94,Risk_Factors!$E$38:$E$39,0),MATCH($E94,Risk_Factors!$O$8:$T$8,0)))","v":""},{"$f":"IF(P94=0,\"\",INDEX(Risk_Factors!$O$41:$T$42,MATCH('1_Risk_Calc'!P94,Risk_Factors!$E$41:$E$42,0),MATCH($E94,Risk_Factors!$O$8:$T$8,0)))","v":""},0,0,null,null,null,"S_085",0]
[null,"S_086",null,null,null,null,null,null,null,null,null,null,null,null,null,null,{"$f":"IF(F95=0,\"\",INDEX(Risk_Factors!$O$12:$T$14,MATCH(F95,Frequency,0),MATCH($E95,Risk_Factors!$O$8:$T$8,0)))","v":""},{"$f":"IF(G95=0,\"\",INDEX(Risk_Factors!$O$15:$T$17,MATCH('1_Risk_Calc'!G95,Position,0),MATCH($E95,Risk_Factors!$O$8:$T$8,0)))","v":""},{"$f":"IF(H95=0,\"\",INDEX(Risk_Factors!$O$18:$T$19,MATCH('1_Risk_Calc'!H95,Yes_No,0),MATCH($E95,Risk_Factors!$O$8:$T$8,0)))","v":""},{"$f":"IF(I95=0,\"\",INDEX(Risk_Factors!$O$20:$T$22,MATCH('1_Risk_Calc'!I95,Dust_amount,0),MATCH($E95,Risk_Factors!$O$8:$T$8,0)))","v":""},{"$f":"IF(J95=0,\"\",INDEX(Risk_Factors!$O$23:$T$25,MATCH('1_Risk_Calc'!J95,Dust_composition,0),MATCH($E95,Risk_Factors!$O$8:$T$8,0)))","v":""},{"$f":"IF(K95=0,\"\",INDEX(Risk_Factors!$O$26:$T$28,MATCH('1_Risk_Calc'!K95,Dust_size,0),MATCH($E95,Risk_Factors!$O$8:$T$8,0)))","v":""},{"$f":"IF(L95=0,\"\",INDEX(Risk_Factors!$O$29:$T$30,MATCH('1_Risk_Calc'!L95,Risk_Factors!$E$29:$E$30,0),MATCH($E95,Risk_Factors!$O$8:$T$8,0)))","v":""},{"$f":"IF(M95=0,\"\",INDEX(Risk_Factors!$O$32:$T$33,MATCH('1_Risk_Calc'!M95,Risk_Factors!$E$32:$E$33,0),MATCH($E95,Risk_Factors!$O$8:$T$8,0)))","v":""},{"$f":"IF(N95=0,\"\",INDEX(Risk_Factors!$O$35:$T$36,MATCH('1_Risk_Calc'!N95,Risk_Factors!$E$35:$E$36,0),MATCH($E95,Risk_Factors!$O$8:$T$8,0)))","v":""},{"$f":"IF(O95=0,\"\",INDEX(Risk_Factors!$O$38:$T$39,MATCH('1_Risk_Calc'!O95,Risk_Factors!$E$38:$E$39,0),MATCH($E95,Risk_Factors!$O$8:$T$8,0)))","v":""},{"$f":"IF(P95=0,\"\",INDEX(Risk_Factors!$O$41:$T$42,MATCH('1_Risk_Calc'!P95,Risk_Factors!$E$41:$E$42,0),MATCH($E95,Risk_Factors!$O$8:$T$8,0)))","v":""},0,0,null,null,null,"S_086",0]
[null,"S_087",null,null,null,null,null,null,null,null,null,null,null,null,null,null,{"$f":"IF(F96=0,\"\",INDEX(Risk_Factors!$O$12:$T$14,MATCH(F96,Frequency,0),MATCH($E96,Risk_Factors!$O$8:$T$8,0)))","v":""},{"$f":"IF(G96=0,\"\",INDEX(Risk_Factors!$O$15:$T$17,MATCH('1_Risk_Calc'!G96,Position,0),MATCH($E96,Risk_Factors!$O$8:$T$8,0)))","v":""},{"$f":"IF(H96=0,\"\",INDEX(Risk_Factors!$O$18:$T$19,MATCH('1_Risk_Calc'!H96,Yes_No,0),MATCH($E96,Risk_Factors!$O$8:$T$8,0)))","v":""},{"$f":"IF(I96=0,\"\",INDEX(Risk_Factors!$O$20:$T$22,MATCH('1_Risk_Calc'!I96,Dust_amount,0),MATCH($E96,Risk_Factors!$O$8:$T$8,0)))","v":""},{"$f":"IF(J96=0,\"\",INDEX(Risk_Factors!$O$23:$T$25,MATCH('1_Risk_Calc'!J96,Dust_composition,0),MATCH($E96,Risk_Factors!$O$8:$T$8,0)))","v":""},{"$f":"IF(K96=0,\"\",INDEX(Risk_Factors!$O$26:$T$28,MATCH('1_Risk_Calc'!K96,Dust_size,0),MATCH($E96,Risk_Factors!$O$8:$T$8,0)))","v":""},{"$f":"IF(L96=0,\"\",INDEX(Risk_Factors!$O$29:$T$30,MATCH('1_Risk_Calc'!L96,Risk_Factors!$E$29:$E$30,0),MATCH($E96,Risk_Factors!$O$8:$T$8,0)))","v":""},{"$f":"IF(M96=0,\"\",INDEX(Risk_Factors!$O$32:$T$33,MATCH('1_Risk_Calc'!M96,Risk_Factors!$E$32:$E$33,0),MATCH($E96,Risk_Factors!$O$8:$T$8,0)))","v":""},{"$f":"IF(N96=0,\"\",INDEX(Risk_Factors!$O$35:$T$36,MATCH('1_Risk_Calc'!N96,Risk_Factors!$E$35:$E$36,0),MATCH($E96,Risk_Factors!$O$8:$T$8,0)))","v":""},{"$f":"IF(O96=0,\"\",INDEX(Risk_Factors!$O$38:$T$39,MATCH('1_Risk_Calc'!O96,Risk_Factors!$E$38:$E$39,0),MATCH($E96,Risk_Factors!$O$8:$T$8,0)))","v":""},{"$f":"IF(P96=0,\"\",INDEX(Risk_Factors!$O$41:$T$42,MATCH('1_Risk_Calc'!P96,Risk_Factors!$E$41:$E$42,0),MATCH($E96,Risk_Factors!$O$8:$T$8,0)))","v":""},0,0,null,null,null,"S_087",0]
[null,"S_088",null,null,null,null,null,null,null,null,null,null,null,null,null,null,{"$f":"IF(F97=0,\"\",INDEX(Risk_Factors!$O$12:$T$14,MATCH(F97,Frequency,0),MATCH($E97,Risk_Factors!$O$8:$T$8,0)))","v":""},{"$f":"IF(G97=0,\"\",INDEX(Risk_Factors!$O$15:$T$17,MATCH('1_Risk_Calc'!G97,Position,0),MATCH($E97,Risk_Factors!$O$8:$T$8,0)))","v":""},{"$f":"IF(H97=0,\"\",INDEX(Risk_Factors!$O$18:$T$19,MATCH('1_Risk_Calc'!H97,Yes_No,0),MATCH($E97,Risk_Factors!$O$8:$T$8,0)))","v":""},{"$f":"IF(I97=0,\"\",INDEX(Risk_Factors!$O$20:$T$22,MATCH('1_Risk_Calc'!I97,Dust_amount,0),MATCH($E97,Risk_Factors!$O$8:$T$8,0)))","v":""},{"$f":"IF(J97=0,\"\",INDEX(Risk_Factors!$O$23:$T$25,MATCH('1_Risk_Calc'!J97,Dust_composition,0),MATCH($E97,Risk_Factors!$O$8:$T$8,0)))","v":""},{"$f":"IF(K97=0,\"\",INDEX(Risk_Factors!$O$26:$T$28,MATCH('1_Risk_Calc'!K97,Dust_size,0),MATCH($E97,Risk_Factors!$O$8:$T$8,0)))","v":""},{"$f":"IF(L97=0,\"\",INDEX(Risk_Factors!$O$29:$T$30,MATCH('1_Risk_Calc'!L97,Risk_Factors!$E$29:$E$30,0),MATCH($E97,Risk_Factors!$O$8:$T$8,0)))","v":""},{"$f":"IF(M97=0,\"\",INDEX(Risk_Factors!$O$32:$T$33,MATCH('1_Risk_Calc'!M97,Risk_Factors!$E$32:$E$33,0),MATCH($E97,Risk_Factors!$O$8:$T$8,0)))","v":""},{"$f":"IF(N97=0,\"\",INDEX(Risk_Factors!$O$35:$T$36,MATCH('1_Risk_Calc'!N97,Risk_Factors!$E$35:$E$36,0),MATCH($E97,Risk_Factors!$O$8:$T$8,0)))","v":""},{"$f":"IF(O97=0,\"\",INDEX(Risk_Factors!$O$38:$T$39,MATCH('1_Risk_Calc'!O97,Risk_Factors!$E$38:$E$39,0),MATCH($E97,Risk_Factors!$O$8:$T$8,0)))","v":""},{"$f":"IF(P97=0,\"\",INDEX(Risk_Factors!$O$41:$T$42,MATCH('1_Risk_Calc'!P97,Risk_Factors!$E$41:$E$42,0),MATCH($E97,Risk_Factors!$O$8:$T$8,0)))","v":""},0,0,null,null,null,"S_088",0]
[null,"S_089",null,null,null,null,null,null,null,null,null,null,null,null,null,null,{"$f":"IF(F98=0,\"\",INDEX(Risk_Factors!$O$12:$T$14,MATCH(F98,Frequency,0),MATCH($E98,Risk_Factors!$O$8:$T$8,0)))","v":""},{"$f":"IF(G98=0,\"\",INDEX(Risk_Factors!$O$15:$T$17,MATCH('1_Risk_Calc'!G98,Position,0),MATCH($E98,Risk_Factors!$O$8:$T$8,0)))","v":""},{"$f":"IF(H98=0,\"\",INDEX(Risk_Factors!$O$18:$T$19,MATCH('1_Risk_Calc'!H98,Yes_No,0),MATCH($E98,Risk_Factors!$O$8:$T$8,0)))","v":""},{"$f":"IF(I98=0,\"\",INDEX(Risk_Factors!$O$20:$T$22,MATCH('1_Risk_Calc'!I98,Dust_amount,0),MATCH($E98,Risk_Factors!$O$8:$T$8,0)))","v":""},{"$f":"IF(J98=0,\"\",INDEX(Risk_Factors!$O$23:$T$25,MATCH('1_Risk_Calc'!J98,Dust_composition,0),MATCH($E98,Risk_Factors!$O$8:$T$8,0)))","v":""},{"$f":"IF(K98=0,\"\",INDEX(Risk_Factors!$O$26:$T$28,MATCH('1_Risk_Calc'!K98,Dust_size,0),MATCH($E98,Risk_Factors!$O$8:$T$8,0)))","v":""},{"$f":"IF(L98=0,\"\",INDEX(Risk_Factors!$O$29:$T$30,MATCH('1_Risk_Calc'!L98,Risk_Factors!$E$29:$E$30,0),MATCH($E98,Risk_Factors!$O$8:$T$8,0)))","v":""},{"$f":"IF(M98=0,\"\",INDEX(Risk_Factors!$O$32:$T$33,MATCH('1_Risk_Calc'!M98,Risk_Factors!$E$32:$E$33,0),MATCH($E98,Risk_Factors!$O$8:$T$8,0)))","v":""},{"$f":"IF(N98=0,\"\",INDEX(Risk_Factors!$O$35:$T$36,MATCH('1_Risk_Calc'!N98,Risk_Factors!$E$35:$E$36,0),MATCH($E98,Risk_Factors!$O$8:$T$8,0)))","v":""},{"$f":"IF(O98=0,\"\",INDEX(Risk_Factors!$O$38:$T$39,MATCH('1_Risk_Calc'!O98,Risk_Factors!$E$38:$E$39,0),MATCH($E98,Risk_Factors!$O$8:$T$8,0)))","v":""},{"$f":"IF(P98=0,\"\",INDEX(Risk_Factors!$O$41:$T$42,MATCH('1_Risk_Calc'!P98,Risk_Factors!$E$41:$E$42,0),MATCH($E98,Risk_Factors!$O$8:$T$8,0)))","v":""},0,0,null,null,null,"S_089",0]
[null,"S_090",null,null,null,null,null,null,null,null,null,null,null,null,null,null,{"$f":"IF(F99=0,\"\",INDEX(Risk_Factors!$O$12:$T$14,MATCH(F99,Frequency,0),MATCH($E99,Risk_Factors!$O$8:$T$8,0)))","v":""},{"$f":"IF(G99=0,\"\",INDEX(Risk_Factors!$O$15:$T$17,MATCH('1_Risk_Calc'!G99,Position,0),MATCH($E99,Risk_Factors!$O$8:$T$8,0)))","v":""},{"$f":"IF(H99=0,\"\",INDEX(Risk_Factors!$O$18:$T$19,MATCH('1_Risk_Calc'!H99,Yes_No,0),MATCH($E99,Risk_Factors!$O$8:$T$8,0)))","v":""},{"$f":"IF(I99=0,\"\",INDEX(Risk_Factors!$O$20:$T$22,MATCH('1_Risk_Calc'!I99,Dust_amount,0),MATCH($E99,Risk_Factors!$O$8:$T$8,0)))","v":""},{"$f":"IF(J99=0,\"\",INDEX(Risk_Factors!$O$23:$T$25,MATCH('1_Risk_Calc'!J99,Dust_composition,0),MATCH($E99,Risk_Factors!$O$8:$T$8,0)))","v":""},{"$f":"IF(K99=0,\"\",INDEX(Risk_Factors!$O$26:$T$28,MATCH('1_Risk_Calc'!K99,Dust_size,0),MATCH($E99,Risk_Factors!$O$8:$T$8,0)))","v":""},{"$f":"IF(L99=0,\"\",INDEX(Risk_Factors!$O$29:$T$30,MATCH('1_Risk_Calc'!L99,Risk_Factors!$E$29:$E$30,0),MATCH($E99,Risk_Factors!$O$8:$T$8,0)))","v":""},{"$f":"IF(M99=0,\"\",INDEX(Risk_Factors!$O$32:$T$33,MATCH('1_Risk_Calc'!M99,Risk_Factors!$E$32:$E$33,0),MATCH($E99,Risk_Factors!$O$8:$T$8,0)))","v":""},{"$f":"IF(N99=0,\"\",INDEX(Risk_Factors!$O$35:$T$36,MATCH('1_Risk_Calc'!N99,Risk_Factors!$E$35:$E$36,0),MATCH($E99,Risk_Factors!$O$8:$T$8,0)))","v":""},{"$f":"IF(O99=0,\"\",INDEX(Risk_Factors!$O$38:$T$39,MATCH('1_Risk_Calc'!O99,Risk_Factors!$E$38:$E$39,0),MATCH($E99,Risk_Factors!$O$8:$T$8,0)))","v":""},{"$f":"IF(P99=0,\"\",INDEX(Risk_Factors!$O$41:$T$42,MATCH('1_Risk_Calc'!P99,Risk_Factors!$E$41:$E$42,0),MATCH($E99,Risk_Factors!$O$8:$T$8,0)))","v":""},0,0,null,null,null,"S_090",0]
[null,"S_091",null,null,null,null,null,null,null,null,null,null,null,null,null,null,{"$f":"IF(F100=0,\"\",INDEX(Risk_Factors!$O$12:$T$14,MATCH(F100,Frequency,0),MATCH($E100,Risk_Factors!$O$8:$T$8,0)))","v":""},{"$f":"IF(G100=0,\"\",INDEX(Risk_Factors!$O$15:$T$17,MATCH('1_Risk_Calc'!G100,Position,0),MATCH($E100,Risk_Factors!$O$8:$T$8,0)))","v":""},{"$f":"IF(H100=0,\"\",INDEX(Risk_Factors!$O$18:$T$19,MATCH('1_Risk_Calc'!H100,Yes_No,0),MATCH($E100,Risk_Factors!$O$8:$T$8,0)))","v":""},{"$f":"IF(I100=0,\"\",INDEX(Risk_Factors!$O$20:$T$22,MATCH('1_Risk_Calc'!I100,Dust_amount,0),MATCH($E100,Risk_Factors!$O$8:$T$8,0)))","v":""},{"$f":"IF(J100=0,\"\",INDEX(Risk_Factors!$O$23:$T$25,MATCH('1_Risk_Calc'!J100,Dust_composition,0),MATCH($E100,Risk_Factors!$O$8:$T$8,0)))","v":""},{"$f":"IF(K100=0,\"\",INDEX(Risk_Factors!$O$26:$T$28,MATCH('1_Risk_Calc'!K100,Dust_size,0),MATCH($E100,Risk_Factors!$O$8:$T$8,0)))","v":""},{"$f":"IF(L100=0,\"\",INDEX(Risk_Factors!$O$29:$T$30,MATCH('1_Risk_Calc'!L100,Risk_Factors!$E$29:$E$30,0),MATCH($E100,Risk_Factors!$O$8:$T$8,0)))","v":""},{"$f":"IF(M100=0,\"\",INDEX(Risk_Factors!$O$32:$T$33,MATCH('1_Risk_Calc'!M100,Risk_Factors!$E$32:$E$33,0),MATCH($E100,Risk_Factors!$O$8:$T$8,0)))","v":""},{"$f":"IF(N100=0,\"\",INDEX(Risk_Factors!$O$35:$T$36,MATCH('1_Risk_Calc'!N100,Risk_Factors!$E$35:$E$36,0),MATCH($E100,Risk_Factors!$O$8:$T$8,0)))","v":""},{"$f":"IF(O100=0,\"\",INDEX(Risk_Factors!$O$38:$T$39,MATCH('1_Risk_Calc'!O100,Risk_Factors!$E$38:$E$39,0),MATCH($E100,Risk_Factors!$O$8:$T$8,0)))","v":""},{"$f":"IF(P100=0,\"\",INDEX(Risk_Factors!$O$41:$T$42,MATCH('1_Risk_Calc'!P100,Risk_Factors!$E$41:$E$42,0),MATCH($E100,Risk_Factors!$O$8:$T$8,0)))","v":""},0,0,null,null,null,"S_091",0]
[null,"S_092",null,null,null,null,null,null,null,null,null,null,null,null,null,null,{"$f":"IF(F101=0,\"\",INDEX(Risk_Factors!$O$12:$T$14,MATCH(F101,Frequency,0),MATCH($E101,Risk_Factors!$O$8:$T$8,0)))","v":""},{"$f":"IF(G101=0,\"\",INDEX(Risk_Factors!$O$15:$T$17,MATCH('1_Risk_Calc'!G101,Position,0),MATCH($E101,Risk_Factors!$O$8:$T$8,0)))","v":""},{"$f":"IF(H101=0,\"\",INDEX(Risk_Factors!$O$18:$T$19,MATCH('1_Risk_Calc'!H101,Yes_No,0),MATCH($E101,Risk_Factors!$O$8:$T$8,0)))","v":""},{"$f":"IF(I101=0,\"\",INDEX(Risk_Factors!$O$20:$T$22,MATCH('1_Risk_Calc'!I101,Dust_amount,0),MATCH($E101,Risk_Factors!$O$8:$T$8,0)))","v":""},{"$f":"IF(J101=0,\"\",INDEX(Risk_Factors!$O$23:$T$25,MATCH('1_Risk_Calc'!J101,Dust_composition,0),MATCH($E101,Risk_Factors!$O$8:$T$8,0)))","v":""},{"$f":"IF(K101=0,\"\",INDEX(Risk_Factors!$O$26:$T$28,MATCH('1_Risk_Calc'!K101,Dust_size,0),MATCH($E101,Risk_Factors!$O$8:$T$8,0)))","v":""},{"$f":"IF(L101=0,\"\",INDEX(Risk_Factors!$O$29:$T$30,MATCH('1_Risk_Calc'!L101,Risk_Factors!$E$29:$E$30,0),MATCH($E101,Risk_Factors!$O$8:$T$8,0)))","v":""},{"$f":"IF(M101=0,\"\",INDEX(Risk_Factors!$O$32:$T$33,MATCH('1_Risk_Calc'!M101,Risk_Factors!$E$32:$E$33,0),MATCH($E101,Risk_Factors!$O$8:$T$8,0)))","v":""},{"$f":"IF(N101=0,\"\",INDEX(Risk_Factors!$O$35:$T$36,MATCH('1_Risk_Calc'!N101,Risk_Factors!$E$35:$E$36,0),MATCH($E101,Risk_Factors!$O$8:$T$8,0)))","v":""},{"$f":"IF(O101=0,\"\",INDEX(Risk_Factors!$O$38:$T$39,MATCH('1_Risk_Calc'!O101,Risk_Factors!$E$38:$E$39,0),MATCH($E101,Risk_Factors!$O$8:$T$8,0)))","v":""},{"$f":"IF(P101=0,\"\",INDEX(Risk_Factors!$O$41:$T$42,MATCH('1_Risk_Calc'!P101,Risk_Factors!$E$41:$E$42,0),MATCH($E101,Risk_Factors!$O$8:$T$8,0)))","v":""},0,0,null,null,null,"S_092",0]
[null,"S_093",null,null,null,null,null,null,null,null,null,null,null,null,null,null,{"$f":"IF(F102=0,\"\",INDEX(Risk_Factors!$O$12:$T$14,MATCH(F102,Frequency,0),MATCH($E102,Risk_Factors!$O$8:$T$8,0)))","v":""},{"$f":"IF(G102=0,\"\",INDEX(Risk_Factors!$O$15:$T$17,MATCH('1_Risk_Calc'!G102,Position,0),MATCH($E102,Risk_Factors!$O$8:$T$8,0)))","v":""},{"$f":"IF(H102=0,\"\",INDEX(Risk_Factors!$O$18:$T$19,MATCH('1_Risk_Calc'!H102,Yes_No,0),MATCH($E102,Risk_Factors!$O$8:$T$8,0)))","v":""},{"$f":"IF(I102=0,\"\",INDEX(Risk_Factors!$O$20:$T$22,MATCH('1_Risk_Calc'!I102,Dust_amount,0),MATCH($E102,Risk_Factors!$O$8:$T$8,0)))","v":""},{"$f":"IF(J102=0,\"\",INDEX(Risk_Factors!$O$23:$T$25,MATCH('1_Risk_Calc'!J102,Dust_composition,0),MATCH($E102,Risk_Factors!$O$8:$T$8,0)))","v":""},{"$f":"IF(K102=0,\"\",INDEX(Risk_Factors!$O$26:$T$28,MATCH('1_Risk_Calc'!K102,Dust_size,0),MATCH($E102,Risk_Factors!$O$8:$T$8,0)))","v":""},{"$f":"IF(L102=0,\"\",INDEX(Risk_Factors!$O$29:$T$30,MATCH('1_Risk_Calc'!L102,Risk_Factors!$E$29:$E$30,0),MATCH($E102,Risk_Factors!$O$8:$T$8,0)))","v":""},{"$f":"IF(M102=0,\"\",INDEX(Risk_Factors!$O$32:$T$33,MATCH('1_Risk_Calc'!M102,Risk_Factors!$E$32:$E$33,0),MATCH($E102,Risk_Factors!$O$8:$T$8,0)))","v":""},{"$f":"IF(N102=0,\"\",INDEX(Risk_Factors!$O$35:$T$36,MATCH('1_Risk_Calc'!N102,Risk_Factors!$E$35:$E$36,0),MATCH($E102,Risk_Factors!$O$8:$T$8,0)))","v":""},{"$f":"IF(O102=0,\"\",INDEX(Risk_Factors!$O$38:$T$39,MATCH('1_Risk_Calc'!O102,Risk_Factors!$E$38:$E$39,0),MATCH($E102,Risk_Factors!$O$8:$T$8,0)))","v":""},{"$f":"IF(P102=0,\"\",INDEX(Risk_Factors!$O$41:$T$42,MATCH('1_Risk_Calc'!P102,Risk_Factors!$E$41:$E$42,0),MATCH($E102,Risk_Factors!$O$8:$T$8,0)))","v":""},0,0,null,null,null,"S_093",0]
[null,"S_094",null,null,null,null,null,null,null,null,null,null,null,null,null,null,{"$f":"IF(F103=0,\"\",INDEX(Risk_Factors!$O$12:$T$14,MATCH(F103,Frequency,0),MATCH($E103,Risk_Factors!$O$8:$T$8,0)))","v":""},{"$f":"IF(G103=0,\"\",INDEX(Risk_Factors!$O$15:$T$17,MATCH('1_Risk_Calc'!G103,Position,0),MATCH($E103,Risk_Factors!$O$8:$T$8,0)))","v":""},{"$f":"IF(H103=0,\"\",INDEX(Risk_Factors!$O$18:$T$19,MATCH('1_Risk_Calc'!H103,Yes_No,0),MATCH($E103,Risk_Factors!$O$8:$T$8,0)))","v":""},{"$f":"IF(I103=0,\"\",INDEX(Risk_Factors!$O$20:$T$22,MATCH('1_Risk_Calc'!I103,Dust_amount,0),MATCH($E103,Risk_Factors!$O$8:$T$8,0)))","v":""},{"$f":"IF(J103=0,\"\",INDEX(Risk_Factors!$O$23:$T$25,MATCH('1_Risk_Calc'!J103,Dust_composition,0),MATCH($E103,Risk_Factors!$O$8:$T$8,0)))","v":""},{"$f":"IF(K103=0,\"\",INDEX(Risk_Factors!$O$26:$T$28,MATCH('1_Risk_Calc'!K103,Dust_size,0),MATCH($E103,Risk_Factors!$O$8:$T$8,0)))","v":""},{"$f":"IF(L103=0,\"\",INDEX(Risk_Factors!$O$29:$T$30,MATCH('1_Risk_Calc'!L103,Risk_Factors!$E$29:$E$30,0),MATCH($E103,Risk_Factors!$O$8:$T$8,0)))","v":""},{"$f":"IF(M103=0,\"\",INDEX(Risk_Factors!$O$32:$T$33,MATCH('1_Risk_Calc'!M103,Risk_Factors!$E$32:$E$33,0),MATCH($E103,Risk_Factors!$O$8:$T$8,0)))","v":""},{"$f":"IF(N103=0,\"\",INDEX(Risk_Factors!$O$35:$T$36,MATCH('1_Risk_Calc'!N103,Risk_Factors!$E$35:$E$36,0),MATCH($E103,Risk_Factors!$O$8:$T$8,0)))","v":""},{"$f":"IF(O103=0,\"\",INDEX(Risk_Factors!$O$38:$T$39,MATCH('1_Risk_Calc'!O103,Risk_Factors!$E$38:$E$39,0),MATCH($E103,Risk_Factors!$O$8:$T$8,0)))","v":""},{"$f":"IF(P103=0,\"\",INDEX(Risk_Factors!$O$41:$T$42,MATCH('1_Risk_Calc'!P103,Risk_Factors!$E$41:$E$42,0),MATCH($E103,Risk_Factors!$O$8:$T$8,0)))","v":""},0,0,null,null,null,"S_094",0]
[null,"S_095",null,null,null,null,null,null,null,null,null,null,null,null,null,null,{"$f":"IF(F104=0,\"\",INDEX(Risk_Factors!$O$12:$T$14,MATCH(F104,Frequency,0),MATCH($E104,Risk_Factors!$O$8:$T$8,0)))","v":""},{"$f":"IF(G104=0,\"\",INDEX(Risk_Factors!$O$15:$T$17,MATCH('1_Risk_Calc'!G104,Position,0),MATCH($E104,Risk_Factors!$O$8:$T$8,0)))","v":""},{"$f":"IF(H104=0,\"\",INDEX(Risk_Factors!$O$18:$T$19,MATCH('1_Risk_Calc'!H104,Yes_No,0),MATCH($E104,Risk_Factors!$O$8:$T$8,0)))","v":""},{"$f":"IF(I104=0,\"\",INDEX(Risk_Factors!$O$20:$T$22,MATCH('1_Risk_Calc'!I104,Dust_amount,0),MATCH($E104,Risk_Factors!$O$8:$T$8,0)))","v":""},{"$f":"IF(J104=0,\"\",INDEX(Risk_Factors!$O$23:$T$25,MATCH('1_Risk_Calc'!J104,Dust_composition,0),MATCH($E104,Risk_Factors!$O$8:$T$8,0)))","v":""},{"$f":"IF(K104=0,\"\",INDEX(Risk_Factors!$O$26:$T$28,MATCH('1_Risk_Calc'!K104,Dust_size,0),MATCH($E104,Risk_Factors!$O$8:$T$8,0)))","v":""},{"$f":"IF(L104=0,\"\",INDEX(Risk_Factors!$O$29:$T$30,MATCH('1_Risk_Calc'!L104,Risk_Factors!$E$29:$E$30,0),MATCH($E104,Risk_Factors!$O$8:$T$8,0)))","v":""},{"$f":"IF(M104=0,\"\",INDEX(Risk_Factors!$O$32:$T$33,MATCH('1_Risk_Calc'!M104,Risk_Factors!$E$32:$E$33,0),MATCH($E104,Risk_Factors!$O$8:$T$8,0)))","v":""},{"$f":"IF(N104=0,\"\",INDEX(Risk_Factors!$O$35:$T$36,MATCH('1_Risk_Calc'!N104,Risk_Factors!$E$35:$E$36,0),MATCH($E104,Risk_Factors!$O$8:$T$8,0)))","v":""},{"$f":"IF(O104=0,\"\",INDEX(Risk_Factors!$O$38:$T$39,MATCH('1_Risk_Calc'!O104,Risk_Factors!$E$38:$E$39,0),MATCH($E104,Risk_Factors!$O$8:$T$8,0)))","v":""},{"$f":"IF(P104=0,\"\",INDEX(Risk_Factors!$O$41:$T$42,MATCH('1_Risk_Calc'!P104,Risk_Factors!$E$41:$E$42,0),MATCH($E104,Risk_Factors!$O$8:$T$8,0)))","v":""},0,0,null,null,null,"S_095",0]
[null,"S_096",null,null,null,null,null,null,null,null,null,null,null,null,null,null,{"$f":"IF(F105=0,\"\",INDEX(Risk_Factors!$O$12:$T$14,MATCH(F105,Frequency,0),MATCH($E105,Risk_Factors!$O$8:$T$8,0)))","v":""},{"$f":"IF(G105=0,\"\",INDEX(Risk_Factors!$O$15:$T$17,MATCH('1_Risk_Calc'!G105,Position,0),MATCH($E105,Risk_Factors!$O$8:$T$8,0)))","v":""},{"$f":"IF(H105=0,\"\",INDEX(Risk_Factors!$O$18:$T$19,MATCH('1_Risk_Calc'!H105,Yes_No,0),MATCH($E105,Risk_Factors!$O$8:$T$8,0)))","v":""},{"$f":"IF(I105=0,\"\",INDEX(Risk_Factors!$O$20:$T$22,MATCH('1_Risk_Calc'!I105,Dust_amount,0),MATCH($E105,Risk_Factors!$O$8:$T$8,0)))","v":""},{"$f":"IF(J105=0,\"\",INDEX(Risk_Factors!$O$23:$T$25,MATCH('1_Risk_Calc'!J105,Dust_composition,0),MATCH($E105,Risk_Factors!$O$8:$T$8,0)))","v":""},{"$f":"IF(K105=0,\"\",INDEX(Risk_Factors!$O$26:$T$28,MATCH('1_Risk_Calc'!K105,Dust_size,0),MATCH($E105,Risk_Factors!$O$8:$T$8,0)))","v":""},{"$f":"IF(L105=0,\"\",INDEX(Risk_Factors!$O$29:$T$30,MATCH('1_Risk_Calc'!L105,Risk_Factors!$E$29:$E$30,0),MATCH($E105,Risk_Factors!$O$8:$T$8,0)))","v":""},{"$f":"IF(M105=0,\"\",INDEX(Risk_Factors!$O$32:$T$33,MATCH('1_Risk_Calc'!M105,Risk_Factors!$E$32:$E$33,0),MATCH($E105,Risk_Factors!$O$8:$T$8,0)))","v":""},{"$f":"IF(N105=0,\"\",INDEX(Risk_Factors!$O$35:$T$36,MATCH('1_Risk_Calc'!N105,Risk_Factors!$E$35:$E$36,0),MATCH($E105,Risk_Factors!$O$8:$T$8,0)))","v":""},{"$f":"IF(O105=0,\"\",INDEX(Risk_Factors!$O$38:$T$39,MATCH('1_Risk_Calc'!O105,Risk_Factors!$E$38:$E$39,0),MATCH($E105,Risk_Factors!$O$8:$T$8,0)))","v":""},{"$f":"IF(P105=0,\"\",INDEX(Risk_Factors!$O$41:$T$42,MATCH('1_Risk_Calc'!P105,Risk_Factors!$E$41:$E$42,0),MATCH($E105,Risk_Factors!$O$8:$T$8,0)))","v":""},0,0,null,null,null,"S_096",0]
[null,"S_097",null,null,null,null,null,null,null,null,null,null,null,null,null,null,{"$f":"IF(F106=0,\"\",INDEX(Risk_Factors!$O$12:$T$14,MATCH(F106,Frequency,0),MATCH($E106,Risk_Factors!$O$8:$T$8,0)))","v":""},{"$f":"IF(G106=0,\"\",INDEX(Risk_Factors!$O$15:$T$17,MATCH('1_Risk_Calc'!G106,Position,0),MATCH($E106,Risk_Factors!$O$8:$T$8,0)))","v":""},{"$f":"IF(H106=0,\"\",INDEX(Risk_Factors!$O$18:$T$19,MATCH('1_Risk_Calc'!H106,Yes_No,0),MATCH($E106,Risk_Factors!$O$8:$T$8,0)))","v":""},{"$f":"IF(I106=0,\"\",INDEX(Risk_Factors!$O$20:$T$22,MATCH('1_Risk_Calc'!I106,Dust_amount,0),MATCH($E106,Risk_Factors!$O$8:$T$8,0)))","v":""},{"$f":"IF(J106=0,\"\",INDEX(Risk_Factors!$O$23:$T$25,MATCH('1_Risk_Calc'!J106,Dust_composition,0),MATCH($E106,Risk_Factors!$O$8:$T$8,0)))","v":""},{"$f":"IF(K106=0,\"\",INDEX(Risk_Factors!$O$26:$T$28,MATCH('1_Risk_Calc'!K106,Dust_size,0),MATCH($E106,Risk_Factors!$O$8:$T$8,0)))","v":""},{"$f":"IF(L106=0,\"\",INDEX(Risk_Factors!$O$29:$T$30,MATCH('1_Risk_Calc'!L106,Risk_Factors!$E$29:$E$30,0),MATCH($E106,Risk_Factors!$O$8:$T$8,0)))","v":""},{"$f":"IF(M106=0,\"\",INDEX(Risk_Factors!$O$32:$T$33,MATCH('1_Risk_Calc'!M106,Risk_Factors!$E$32:$E$33,0),MATCH($E106,Risk_Factors!$O$8:$T$8,0)))","v":""},{"$f":"IF(N106=0,\"\",INDEX(Risk_Factors!$O$35:$T$36,MATCH('1_Risk_Calc'!N106,Risk_Factors!$E$35:$E$36,0),MATCH($E106,Risk_Factors!$O$8:$T$8,0)))","v":""},{"$f":"IF(O106=0,\"\",INDEX(Risk_Factors!$O$38:$T$39,MATCH('1_Risk_Calc'!O106,Risk_Factors!$E$38:$E$39,0),MATCH($E106,Risk_Factors!$O$8:$T$8,0)))","v":""},{"$f":"IF(P106=0,\"\",INDEX(Risk_Factors!$O$41:$T$42,MATCH('1_Risk_Calc'!P106,Risk_Factors!$E$41:$E$42,0),MATCH($E106,Risk_Factors!$O$8:$T$8,0)))","v":""},0,{"$f":"(AB106/MAX($AB$10:$AB$109))*$AC$5","v":0},null,null,null,"S_097",0]
[null,"S_098",null,null,null,null,null,null,null,null,null,null,null,null,null,null,{"$f":"IF(F107=0,\"\",INDEX(Risk_Factors!$O$12:$T$14,MATCH(F107,Frequency,0),MATCH($E107,Risk_Factors!$O$8:$T$8,0)))","v":""},{"$f":"IF(G107=0,\"\",INDEX(Risk_Factors!$O$15:$T$17,MATCH('1_Risk_Calc'!G107,Position,0),MATCH($E107,Risk_Factors!$O$8:$T$8,0)))","v":""},{"$f":"IF(H107=0,\"\",INDEX(Risk_Factors!$O$18:$T$19,MATCH('1_Risk_Calc'!H107,Yes_No,0),MATCH($E107,Risk_Factors!$O$8:$T$8,0)))","v":""},{"$f":"IF(I107=0,\"\",INDEX(Risk_Factors!$O$20:$T$22,MATCH('1_Risk_Calc'!I107,Dust_amount,0),MATCH($E107,Risk_Factors!$O$8:$T$8,0)))","v":""},{"$f":"IF(J107=0,\"\",INDEX(Risk_Factors!$O$23:$T$25,MATCH('1_Risk_Calc'!J107,Dust_composition,0),MATCH($E107,Risk_Factors!$O$8:$T$8,0)))","v":""},{"$f":"IF(K107=0,\"\",INDEX(Risk_Factors!$O$26:$T$28,MATCH('1_Risk_Calc'!K107,Dust_size,0),MATCH($E107,Risk_Factors!$O$8:$T$8,0)))","v":""},{"$f":"IF(L107=0,\"\",INDEX(Risk_Factors!$O$29:$T$30,MATCH('1_Risk_Calc'!L107,Risk_Factors!$E$29:$E$30,0),MATCH($E107,Risk_Factors!$O$8:$T$8,0)))","v":""},{"$f":"IF(M107=0,\"\",INDEX(Risk_Factors!$O$32:$T$33,MATCH('1_Risk_Calc'!M107,Risk_Factors!$E$32:$E$33,0),MATCH($E107,Risk_Factors!$O$8:$T$8,0)))","v":""},{"$f":"IF(N107=0,\"\",INDEX(Risk_Factors!$O$35:$T$36,MATCH('1_Risk_Calc'!N107,Risk_Factors!$E$35:$E$36,0),MATCH($E107,Risk_Factors!$O$8:$T$8,0)))","v":""},{"$f":"IF(O107=0,\"\",INDEX(Risk_Factors!$O$38:$T$39,MATCH('1_Risk_Calc'!O107,Risk_Factors!$E$38:$E$39,0),MATCH($E107,Risk_Factors!$O$8:$T$8,0)))","v":""},{"$f":"IF(P107=0,\"\",INDEX(Risk_Factors!$O$41:$T$42,MATCH('1_Risk_Calc'!P107,Risk_Factors!$E$41:$E$42,0),MATCH($E107,Risk_Factors!$O$8:$T$8,0)))","v":""},0,0,null,null,null,"S_098",0]
[null,"S_099",null,null,null,null,null,null,null,null,null,null,null,null,null,null,{"$f":"IF(F108=0,\"\",INDEX(Risk_Factors!$O$12:$T$14,MATCH(F108,Frequency,0),MATCH($E108,Risk_Factors!$O$8:$T$8,0)))","v":""},{"$f":"IF(G108=0,\"\",INDEX(Risk_Factors!$O$15:$T$17,MATCH('1_Risk_Calc'!G108,Position,0),MATCH($E108,Risk_Factors!$O$8:$T$8,0)))","v":""},{"$f":"IF(H108=0,\"\",INDEX(Risk_Factors!$O$18:$T$19,MATCH('1_Risk_Calc'!H108,Yes_No,0),MATCH($E108,Risk_Factors!$O$8:$T$8,0)))","v":""},{"$f":"IF(I108=0,\"\",INDEX(Risk_Factors!$O$20:$T$22,MATCH('1_Risk_Calc'!I108,Dust_amount,0),MATCH($E108,Risk_Factors!$O$8:$T$8,0)))","v":""},{"$f":"IF(J108=0,\"\",INDEX(Risk_Factors!$O$23:$T$25,MATCH('1_Risk_Calc'!J108,Dust_composition,0),MATCH($E108,Risk_Factors!$O$8:$T$8,0)))","v":""},{"$f":"IF(K108=0,\"\",INDEX(Risk_Factors!$O$26:$T$28,MATCH('1_Risk_Calc'!K108,Dust_size,0),MATCH($E108,Risk_Factors!$O$8:$T$8,0)))","v":""},{"$f":"IF(L108=0,\"\",INDEX(Risk_Factors!$O$29:$T$30,MATCH('1_Risk_Calc'!L108,Risk_Factors!$E$29:$E$30,0),MATCH($E108,Risk_Factors!$O$8:$T$8,0)))","v":""},{"$f":"IF(M108=0,\"\",INDEX(Risk_Factors!$O$32:$T$33,MATCH('1_Risk_Calc'!M108,Risk_Factors!$E$32:$E$33,0),MATCH($E108,Risk_Factors!$O$8:$T$8,0)))","v":""},{"$f":"IF(N108=0,\"\",INDEX(Risk_Factors!$O$35:$T$36,MATCH('1_Risk_Calc'!N108,Risk_Factors!$E$35:$E$36,0),MATCH($E108,Risk_Factors!$O$8:$T$8,0)))","v":""},{"$f":"IF(O108=0,\"\",INDEX(Risk_Factors!$O$38:$T$39,MATCH('1_Risk_Calc'!O108,Risk_Factors!$E$38:$E$39,0),MATCH($E108,Risk_Factors!$O$8:$T$8,0)))","v":""},{"$f":"IF(P108=0,\"\",INDEX(Risk_Factors!$O$41:$T$42,MATCH('1_Risk_Calc'!P108,Risk_Factors!$E$41:$E$42,0),MATCH($E108,Risk_Factors!$O$8:$T$8,0)))","v":""},0,0,null,null,null,"S_099",0]
[null,"S_100",null,null,null,null,null,null,null,null,null,null,null,null,null,null,{"$f":"IF(F109=0,\"\",INDEX(Risk_Factors!$O$12:$T$14,MATCH(F109,Frequency,0),MATCH($E109,Risk_Factors!$O$8:$T$8,0)))","v":""},{"$f":"IF(G109=0,\"\",INDEX(Risk_Factors!$O$15:$T$17,MATCH('1_Risk_Calc'!G109,Position,0),MATCH($E109,Risk_Factors!$O$8:$T$8,0)))","v":""},{"$f":"IF(H109=0,\"\",INDEX(Risk_Factors!$O$18:$T$19,MATCH('1_Risk_Calc'!H109,Yes_No,0),MATCH($E109,Risk_Factors!$O$8:$T$8,0)))","v":""},{"$f":"IF(I109=0,\"\",INDEX(Risk_Factors!$O$20:$T$22,MATCH('1_Risk_Calc'!I109,Dust_amount,0),MATCH($E109,Risk_Factors!$O$8:$T$8,0)))","v":""},{"$f":"IF(J109=0,\"\",INDEX(Risk_Factors!$O$23:$T$25,MATCH('1_Risk_Calc'!J109,Dust_composition,0),MATCH($E109,Risk_Factors!$O$8:$T$8,0)))","v":""},{"$f":"IF(K109=0,\"\",INDEX(Risk_Factors!$O$26:$T$28,MATCH('1_Risk_Calc'!K109,Dust_size,0),MATCH($E109,Risk_Factors!$O$8:$T$8,0)))","v":""},{"$f":"IF(L109=0,\"\",INDEX(Risk_Factors!$O$29:$T$30,MATCH('1_Risk_Calc'!L109,Risk_Factors!$E$29:$E$30,0),MATCH($E109,Risk_Factors!$O$8:$T$8,0)))","v":""},{"$f":"IF(M109=0,\"\",INDEX(Risk_Factors!$O$32:$T$33,MATCH('1_Risk_Calc'!M109,Risk_Factors!$E$32:$E$33,0),MATCH($E109,Risk_Factors!$O$8:$T$8,0)))","v":""},{"$f":"IF(N109=0,\"\",INDEX(Risk_Factors!$O$35:$T$36,MATCH('1_Risk_Calc'!N109,Risk_Factors!$E$35:$E$36,0),MATCH($E109,Risk_Factors!$O$8:$T$8,0)))","v":""},{"$f":"IF(O109=0,\"\",INDEX(Risk_Factors!$O$38:$T$39,MATCH('1_Risk_Calc'!O109,Risk_Factors!$E$38:$E$39,0),MATCH($E109,Risk_Factors!$O$8:$T$8,0)))","v":""},{"$f":"IF(P109=0,\"\",INDEX(Risk_Factors!$O$41:$T$42,MATCH('1_Risk_Calc'!P109,Risk_Factors!$E$41:$E$42,0),MATCH($E109,Risk_Factors!$O$8:$T$8,0)))","v":""},0,0,null,null,null,"S_100",0]
[]
[]
["2 - Sources Ranked According to Risk Score"]
[null,null,null,null,null,null,null,null,null,null,null,null,null,null,null,null,"Risk Score"]
[null,"Source ID Number","Description of the structure / equipment","Location","Category","Total Normal.",null,null,null,null,null,null,null,null,null,null,"A","B","C","D","E","F","G","H","I","J","K","Total"]
[1,{"$f":"IF(AB115=0,\"\",INDEX(B$1:B$109,$I115))","v":"S_001"},{"$f":"IF(AB115=0,\"\",INDEX(C$1:C$109,$I115))","v":"WCS - Worst Case Scenario"},{"$f":"IF(AB115=0,\"\",INDEX(D$1:D$109,$I115))","v":"—"},{"$f":"IF(AB115=0,\"\",INDEX(E$1:E$109,$I115))","v":"Process"},{"$f":"(AB115/MAX($AB$115:$AB$214))*$AC$5","v":100},{"$f":"IF(SUM(Q115:AA115)=AB115,\"ok\",\"check\")","v":"ok"},{"$f":"MATCH(AB115,$AB$1:$AB$109,0)","v":10},{"$f":"IF(H115=G114,MATCH(AB115,INDIRECT(\"AB\"&(AE114+1)&\":AB105\"),0)+AE114,H115)","v":10},null,null,null,null,null,null,null,{"$f":"INDEX(Q$1:Q$109,$I115)","v":0.1317536033625},5.6068080250000006E-2,7.2206943750000002E-2,3.8270426512500011E-2,2.7475000000000003E-2,4.7021524831250001E-2,0.03,3.0039581250000003E-2,3.0039581250000003E-2,3.0039581250000003E-2,3.0039581250000003E-2,{"$f":"LARGE($AB$10:$AB$109,A115)","v":0.52295390370625006}]
[{"$f":"A115+1","v":2},"","","","",0,"ok",11,{"$f":"IF(H116=G115,MATCH(AB116,INDIRECT(\"AB\"&(H115+1)&\":AB105\"),0)+H115,H116)","v":11},null,null,null,null,null,null,null,"","","","","","","","","","","",0]
[{"$f":"A116+1","v":3},"","","","",0,"ok",11,11,null,null,null,null,null,null,null,"","","","","","","","","","","",0]
[4,"","","","",0,"ok",11,11,null,null,null,null,null,null,null,"","","","","","","","","","","",0]
[5,"","","","",0,"ok",11,11,null,null,null,null,null,null,null,"","","","","","","","","","","",0]
[6,"","","","",0,"ok",11,11,null,null,null,null,null,null,null,"","","","","","","","","","","",0]
[7,"","","","",0,"ok",11,11,null,null,null,null,null,null,null,"","","","","","","","","","","",0]
[8,"","","","",0,"ok",11,11,null,null,null,null,null,null,null,"","","","","","","","","","","",0]
[9,"","","","",0,"ok",11,11,null,null,null,null,null,null,null,"","","","","","","","","","","",0]
[10,"","","","",0,"ok",11,11,null,null,null,null,null,null,null,"","","","","","","","","","","",0]
[11,"","","","",0,"ok",11,11,null,null,null,null,null,null,null,{"$f":"INDEX(Q$1:Q$109,$I125)","v":""},"","","","","","","","","","",0]
[12,"","","","",0,"ok",11,11,null,null,null,null,null,null,null,"","","","","","","","","","","",0]
[13,"","","","",0,"ok",11,11,null,null,null,null,null,null,null,"","","","","","","","","","","",0]
[14,"","","","",0,"ok",11,11,null,null,null,null,null,null,null,"","","","","","","","","","","",0]
[15,"","","","",0,"ok",11,11,null,null,null,null,null,null,null,"","","","","","","","","","","",0]
[16,"","","","",0,"ok",11,11,null,null,null,null,null,null,null,"","","","","","","","","","","",0]
[17,"","","","",0,"ok",11,11,null,null,null,null,null,null,null,"","","","","","","","","","","",0]
[18,"","","","",0,"ok",11,11,null,null,null,null,null,null,null,"","","","","","","","","","","",0]
[19,"","","","",0,"ok",11,11,null,null,null,null,null,null,null,"","","","","","","","","","","",0]
[20,"","","","",0,"ok",11,11,null,null,null,null,null,null,null,"","","","","","","","","","","",0]
[21,"","","","",0,"ok",11,11,null,null,null,null,null,null,null,{"$f":"INDEX(Q$1:Q$109,$I135)","v":""},"","","","","","","","","","",0]
[22,"","","","",0,"ok",11,11,null,null,null,null,null,null,null,"","","","","","","","","","","",0]
[23,"","","","",0,"ok",11,11,null,null,null,null,null,null,null,"","","","","","","","","","","",0]
[24,"","","","",0,"ok",11,11,null,null,null,null,null,null,null,"","","","","","","","","","","",0]
[25,"","","","",0,"ok",11,11,null,null,null,null,null,null,null,"","","","","","","","","","","",0]
[26,"","","","",0,"ok",11,11,null,null,null,null,null,null,null,"","","","","","","","","","","",0]
[27,"","","","",0,"ok",11,11,null,null,null,null,null,null,null,"","","","","","","","","","","",0]
[28,"","","","",0,"ok",11,11,null,null,null,null,null,null,null,"","","","","","","","","","","",0]
[29,"","","","",0,"ok",11,11,null,null,null,null,null,null,null,"","","","","","","","","","","",0]
[30,"","","","",0,"ok",11,11,null,null,null,null,null,null,null,"","","","","","","","","","","",0]
[31,"","","","",0,"ok",11,11,null,null,null,null,null,null,null,{"$f":"INDEX(Q$1:Q$109,$I145)","v":""},"","","","","","","","","","",0]
[32,"","","","",0,"ok",11,11,null,null,null,null,null,null,null,"","","","","","","","","","","",0]
[33,{"$f":"IF(AB147=0,\"\",INDEX(B$1:B$109,$I147))","v":""},{"$f":"IF(AB147=0,\"\",INDEX(C$1:C$109,$I147))","v":""},{"$f":"IF(AB147=0,\"\",INDEX(D$1:D$109,$I147))","v":""},{"$f":"IF(AB147=0,\"\",INDEX(E$1:E$109,$I147))","v":""},{"$f":"(AB147/MAX($AB$115:$AB$214))*$AC$5","v":0},{"$f":"IF(SUM(Q147:AA147)=AB147,\"ok\",\"check\")","v":"ok"},{"$f":"MATCH(AB147,$AB$1:$AB$109,0)","v":11},11,null,null,null,null,null,null,null,"","","","","","","","","","","",{"$f":"LARGE($AB$10:$AB$109,A147)","v":0}]
[34,"","","","",0,"ok",11,{"$f":"IF(H148=G147,MATCH(AB148,INDIRECT(\"AB\"&(H147+1)&\":AB105\"),0)+H147,H148)","v":11},null,null,null,null,null,null,null,"","","","","","","","","","","",0]
[35,"","","","",0,"ok",11,11,null,null,null,null,null,null,null,"","","","","","","","","","","",0]
[36,"","","","",0,"ok",11,11,null,null,null,null,null,null,null,"","","","","","","","","","","",0]
[37,"","","","",0,"ok",11,11,null,null,null,null,null,null,null,"","","","","","","","","","","",0]
[38,"","","","",0,"ok",11,11,null,null,null,null,null,null,null,"","","","","","","","","","","",0]
[39,"","","","",0,"ok",11,11,null,null,null,null,null,null,null,"","","","","","","","","","","",0]
[40,"","","","",0,"ok",11,11,null,null,null,null,null,null,null,"","","","","","","","","","","",0]
[41,"","","","",0,"ok",11,11,null,null,null,null,null,null,null,{"$f":"INDEX(Q$1:Q$109,$I155)","v":""},"","","","","","","","","","",0]
[42,"","","","",0,"ok",11,11,null,null,null,null,null,null,null,"","","","","","","","","","","",0]
[43,"","","","",0,"ok",11,11,null,null,null,null,null,null,null,"","","","","","","","","","","",0]
[44,"","","","",0,"ok",11,11,null,null,null,null,null,null,null,"","","","","","","","","","","",0]
[45,"","","","",0,"ok",11,11,null,null,null,null,null,null,null,"","","","","","","","","","","",0]
[46,"","","","",0,"ok",11,11,null,null,null,null,null,null,null,"","","","","","","","","","","",0]
[47,"","","","",0,"ok",11,11,null,null,null,null,null,null,null,"","","","","","","","","","","",0]
[48,"","","","",0,"ok",11,11,null,null,null,null,null,null,null,"","","","","","","","","","","",0]
[49,"","","","",0,"ok",11,11,null,null,null,null,null,null,null,"","","","","","","","","","","",0]
[50,"","","","",0,"ok",11,11,null,null,null,null,null,null,null,"","","","","","","","","","","",{"$f":"LARGE($AB$10:$AB$109,A164)","v":0}]
[51,"","","","",0,"ok",11,11,null,null,null,null,null,null,null,{"$f":"INDEX(Q$1:Q$109,$I165)","v":""},"","","","","","","","","","",0]
[52,"","","","",0,"ok",11,11,null,null,null,null,null,null,null,"","","","","","","","","","","",0]
[53,"","","","",0,"ok",11,11,null,null,null,null,null,null,null,"","","","","","","","","","","",0]
[54,"","","","",0,"ok",11,11,null,null,null,null,null,null,null,"","","","","","","","","","","",0]
[55,"","","","",0,"ok",11,11,null,null,null,null,null,null,null,"","","","","","","","","","","",0]
[56,"","","","",0,"ok",11,11,null,null,null,null,null,null,null,"","","","","","","","","","","",0]
[57,"","","","",0,"ok",11,11,null,null,null,null,null,null,null,"","","","","","","","","","","",0]
[58,"","","","",0,"ok",11,11,null,null,null,null,null,null,null,"","","","","","","","","","","",0]
[59,"","","","",0,"ok",11,11,null,null,null,null,null,null,null,"","","","","","","","","","","",0]
[60,"","","","",0,"ok",11,11,null,null,null,null,null,null,null,"","","","","","","","","","","",0]
[61,"","","","",0,"ok",11,11,null,null,null,null,null,null,null,{"$f":"INDEX(Q$1:Q$109,$I175)","v":""},"","","","","","","","","","",0]
[62,"","","","",0,"ok",11,11,null,null,null,null,null,null,null,"","","","","","","","","","","",0]
[63,"","","","",0,"ok",11,11,null,null,null,null,null,null,null,"","","","","","","","","","","",0]
[64,"","","","",0,"ok",11,11,null,null,null,null,null,null,null,"","","","","","","","","","","",0]
[65,{"$f":"IF(AB179=0,\"\",INDEX(B$1:B$109,$I179))","v":""},{"$f":"IF(AB179=0,\"\",INDEX(C$1:C$109,$I179))","v":""},{"$f":"IF(AB179=0,\"\",INDEX(D$1:D$109,$I179))","v":""},{"$f":"IF(AB179=0,\"\",INDEX(E$1:E$109,$I179))","v":""},{"$f":"(AB179/MAX($AB$115:$AB$214))*$AC$5","v":0},{"$f":"IF(SUM(Q179:AA179)=AB179,\"ok\",\"check\")","v":"ok"},{"$f":"MATCH(AB179,$AB$1:$AB$109,0)","v":11},11,null,null,null,null,null,null,null,"","","","","","","","","","","",0]
[66,"","","","",0,"ok",11,{"$f":"IF(H180=G179,MATCH(AB180,INDIRECT(\"AB\"&(H179+1)&\":AB105\"),0)+H179,H180)","v":11},null,null,null,null,null,null,null,"","","","","","","","","","","",0]
[{"$f":"A180+1","v":67},"","","","",0,"ok",11,11,null,null,null,null,null,null,null,"","","","","","","","","","","",0]
[68,"","","","",0,"ok",11,11,null,null,null,null,null,null,null,"","","","","","","","","","","",0]
[69,"","","","",0,"ok",11,11,null,null,null,null,null,null,null,"","","","","","","","","","","",0]
[70,"","","","",0,"ok",11,11,null,null,null,null,null,null,null,"","","","","","","","","","","",0]
[71,"","","","",0,"ok",11,11,null,null,null,null,null,null,null,{"$f":"INDEX(Q$1:Q$109,$I185)","v":""},"","","","","","","","","","",0]
[72,"","","","",0,"ok",11,11,null,null,null,null,null,null,null,"","","","","","","","","","","",0]
[73,"","","","",0,"ok",11,11,null,null,null,null,null,null,null,"","","","","","","","","","","",0]
[74,"","","","",0,"ok",11,11,null,null,null,null,null,null,null,"","","","","","","","","","","",0]
[75,"","","","",0,"ok",11,11,null,null,null,null,null,null,null,"","","","","","","","","","","",0]
[76,"","","","",0,"ok",11,11,null,null,null,null,null,null,null,"","","","","","","","","","","",0]
[77,"","","","",0,"ok",11,11,null,null,null,null,null,null,null,"","","","","","","","","","","",0]
[78,"","","","",0,"ok",11,11,null,null,null,null,null,null,null,"","","","","","","","","","","",0]
[79,"","","","",0,"ok",11,11,null,null,null,null,null,null,null,"","","","","","","","","","","",0]
[80,"","","","",0,"ok",11,11,null,null,null,null,null,null,null,"","","","","","","","","","","",0]
[81,"","","","",0,"ok",11,11,null,null,null,null,null,null,null,{"$f":"INDEX(Q$1:Q$109,$I195)","v":""},"","","","","","","","","","",0]
[82,"","","","",0,"ok",11,11,null,null,null,null,null,null,null,"","","","","","","","","","","",0]
[83,"","","","",0,"ok",11,11,null,null,null,null,null,null,null,"","","","","","","","","","","",0]
[84,"","","","",0,"ok",11,11,null,null,null,null,null,null,null,"","","","","","","","","","","",0]
[85,"","","","",0,"ok",11,11,null,null,null,null,null,null,null,"","","","","","","","","","","",0]
[86,"","","","",0,"ok",11,11,null,null,null,null,null,null,null,"","","","","","","","","","","",0]
[87,"","","","",0,"ok",11,11,null,null,null,null,null,null,null,"","","","","","","","","","","",0]
[88,"","","","",0,"ok",11,11,null,null,null,null,null,null,null,"","","","","","","","","","","",0]
[89,"","","","",0,"ok",11,11,null,null,null,null,null,null,null,"","","","","","","","","","","",0]
[90,"","","","",0,"ok",11,11,null,null,null,null,null,null,null,"","","","","","","","","","","",0]
[91,"","","","",0,"ok",11,11,null,null,null,null,null,null,null,{"$f":"INDEX(Q$1:Q$109,$I205)","v":""},"","","","","","","","","","",0]
[92,"","","","",0,"ok",11,11,null,null,null,null,null,null,null,"","","","","","","","","","","",0]
[93,"","","","",0,"ok",11,11,null,null,null,null,null,null,null,"","","","","","","","","","","",0]
[94,"","","","",0,"ok",11,11,null,null,null,null,null,null,null,"","","","","","","","","","","",{"$f":"LARGE($AB$10:$AB$109,A208)","v":0}]
[95,"","","","",0,"ok",11,11,null,null,null,null,null,null,null,"","","","","","","","","","","",0]
[96,"","","","",0,"ok",11,11,null,null,null,null,null,null,null,"","","","","","","","","","","",0]
[97,"","","","",0,"ok",11,11,null,null,null,null,null,null,null,"","","","","","","","","","","",0]
[98,"","","","",0,"ok",11,{"$f":"IF(H212=G211,MATCH(AB212,INDIRECT(\"AB\"&(H211+1)&\":AB105\"),0)+H211,H212)","v":11},null,null,null,null,null,null,null,"","","","","","","","","","","",0]
[99,"","","","",0,"ok",11,11,null,null,null,null,null,null,null,"","","","","","","","","","","",{"$f":"LARGE($AB$10:$AB$109,A213)","v":0}]
[100,"","","","",0,"ok",11,11,null,null,null,null,null,null,null,"","","","","","","","","","","",0]

{"sheet":"2_Alternatives","index":2,"n_rows":35,"n_cols":69,"rows_kept":35,"cut":false,"hidden":false,"merged":[[9,29,9,30],[9,31,10,31],[10,2,10,3],[8,1,9,1],[8,2,9,2],[8,3,9,3],[8,4,9,4],[8,5,8,15],[9,16,9,28]]}
[null,"Fugitive Dust Risk Management Tool",null,null,null,"Source","Path","Path","Source","Receptor","Path / Receptor","Path","Source","Source","Source","Source",null,null,null,null,null,null,null,null,null,null,null,null,null,null,null,null,null,null,null,null,0,{"$f":"AC9","v":50},{"$f":"AC8","v":75}]
[null,null,null,null,null,null,null,null,null,null,null,null,null,null,null,null,null,null,null,null,null,null,null,null,null,null,null,null,null,null,null,null,null,null,null,null,100,{"$f":"AC9","v":50},{"$f":"AC8","v":75}]
[{"$f":"\"Step 2 - \"&DashBoard!E9","v":"Step 2 - Assessment of alternatives for fugitive dust control"}]
[]
[null,null,"Cells to be populated"]
[null,null,"Drop-down menu",null,null,null,null,null,null,null,null,null,null,null,null,null,null,null,null,null,null,null,null,null,null,null,null,null,null,null,null,null,null,null,null,null,null,null,null,null,null,null,null,null,null,null,null,null,null,null,null,null,null,null,null,null,null,null,null,null,null,null,null,null,null,null,null,null," "]
[null,null,"Automatically",null,null,null,null,null,null,null,null,null,null,null,null,null,null,null,null,null,null,null,null,null,null,null,null,null,{"$f":"'1_Risk_Calc'!AC5","v":100},"Max:"]
[null,null,null,null,null,null,null,null,null,null,null,null,null,null,null,null,null,null,null,null,null,null,null,null,null,null,null,null,{"$f":"'1_Risk_Calc'!AC6","v":75},"Red: >"]
[null,"Source ID Number","Description of the structure / equipment","Location","Category","Risk Factors",null,null,null,null,null,null,null,null,null,null,null,null,null,null,null,null,null,null,null,null,null,null,{"$f":"'1_Risk_Calc'!AC7","v":50},"Yellow: >",null,null,null,null,null,null,null,null,null,null,null,null,null,null,null,null,null,null,null,null,null,null,null,null,"Risk Reduction Target",200,{"$f":"IF(MIN($AA$5:$AA$18)<0,ROUNDUP(MIN($AA$5:$AA$18),1)*1.1,0)","v":0}]
[null,null,null,null,null,"A","B","C","D","E","F","G","H","I","J","K","Risk Score",null,null,null,null,null,null,null,null,null,null,null,null,"Reduction",null,"Cost Benefit ($/ risk reduction)",null,null,null,null,null,null,null,null,null,null,null,null,null,null,null,null,null,null,null,null,null,null,null,200,{"$f":"SUM(AZ12)*2","v":0}]
[null,"Alternatives","Description of the Alternatives",null,"Costs","Frequency of process / activity that generates fugitive dust:","Position of the source related to sensitive areas (e.g.: communities, working areas):","Predominant wind direction is from the source to the closest sensitive area?","Relative amount of visible dust generated in the process / activity:","Dust composition","Dust size range (higher mass percentage)","Is there some wind barrier (e.g.: trees, buldings, landscape) which can prevent the emissions from this source to reach the closest sensitive area?","Is there some measure applied on regular basis to prevent dust emission from this source?","Is there some measure applied to this source to reduce dust emission once it occur (reactive)?","Is there some monitoring procedure applied to this source related to fugitive dust control?","Monitoring data / information trigger some control measure?","A","B","C","D","E","F","G","H","I","J","K","Total","Total Normal.","Absolute","Total",null,null,null,null,null,null,null,null,null,null,"Alternatives","Risk Reduction","Average Annual GHG Reductions","Cost per ton reduced","Cost Ranking",null,"Alternatives",null,{"$f":"AQ11","v":"Risk Reduction"},{"$f":"AR11","v":"Average Annual GHG Reductions"},{"$f":"AS11","v":"Cost per ton reduced"},"Cumulative Reduction - Annual",null,"Alternatives",{"$f":"BA11","v":"Cumulative Reduction - Annual"},"Limit Cost",{"$f":"IFERROR(OFFSET($AV$12,COLUMN(BF11)-COLUMN($BF11),0),\"\")","v":""},{"$f":"IFERROR(OFFSET($AV$12,COLUMN(BG11)-COLUMN($BF11),0),\"\")","v":""},"","","","","",""]
[null,null,{"$f":"IF($B12=0,\"\",INDEX('1_Risk_Calc'!C$10:C$109,MATCH('2_Alternatives'!$B12,'1_Risk_Calc'!$B$10:$B$109,0)))","v":""},{"$f":"IF($B12=0,\"\",INDEX('1_Risk_Calc'!D$10:D$109,MATCH('2_Alternatives'!$B12,'1_Risk_Calc'!$B$10:$B$109,0)))","v":""},{"$f":"IF($B12=0,\"\",INDEX('1_Risk_Calc'!E$10:E$109,MATCH('2_Alternatives'!$B12,'1_Risk_Calc'!$B$10:$B$109,0)))","v":""},{"$f":"IF($B12=0,\"\",INDEX('1_Risk_Calc'!F$10:F$109,MATCH('2_Alternatives'!$B12,'1_Risk_Calc'!$B$10:$B$109,0)))","v":""},{"$f":"IF($B12=0,\"\",INDEX('1_Risk_Calc'!G$10:G$109,MATCH('2_Alternatives'!$B12,'1_Risk_Calc'!$B$10:$B$109,0)))","v":""},{"$f":"IF($B12=0,\"\",INDEX('1_Risk_Calc'!H$10:H$109,MATCH('2_Alternatives'!$B12,'1_Risk_Calc'!$B$10:$B$109,0)))","v":""},{"$f":"IF($B12=0,\"\",INDEX('1_Risk_Calc'!I$10:I$109,MATCH('2_Alternatives'!$B12,'1_Risk_Calc'!$B$10:$B$109,0)))","v":""},{"$f":"IF($B12=0,\"\",INDEX('1_Risk_Calc'!J$10:J$109,MATCH('2_Alternatives'!$B12,'1_Risk_Calc'!$B$10:$B$109,0)))","v":""},{"$f":"IF($B12=0,\"\",INDEX('1_Risk_Calc'!K$10:K$109,MATCH('2_Alternatives'!$B12,'1_Risk_Calc'!$B$10:$B$109,0)))","v":""},{"$f":"IF($B12=0,\"\",INDEX('1_Risk_Calc'!L$10:L$109,MATCH('2_Alternatives'!$B12,'1_Risk_Calc'!$B$10:$B$109,0)))","v":""},{"$f":"IF($B12=0,\"\",INDEX('1_Risk_Calc'!M$10:M$109,MATCH('2_Alternatives'!$B12,'1_Risk_Calc'!$B$10:$B$109,0)))","v":""},{"$f":"IF($B12=0,\"\",INDEX('1_Risk_Calc'!N$10:N$109,MATCH('2_Alternatives'!$B12,'1_Risk_Calc'!$B$10:$B$109,0)))","v":""},{"$f":"IF($B12=0,\"\",INDEX('1_Risk_Calc'!O$10:O$109,MATCH('2_Alternatives'!$B12,'1_Risk_Calc'!$B$10:$B$109,0)))","v":""},{"$f":"IF($B12=0,\"\",INDEX('1_Risk_Calc'!P$10:P$109,MATCH('2_Alternatives'!$B12,'1_Risk_Calc'!$B$10:$B$109,0)))","v":""},{"$f":"IF($B12=0,\"\",INDEX('1_Risk_Calc'!Q$10:Q$109,MATCH('2_Alternatives'!$B12,'1_Risk_Calc'!$B$10:$B$109,0)))","v":""},{"$f":"IF($B12=0,\"\",INDEX('1_Risk_Calc'!R$10:R$109,MATCH('2_Alternatives'!$B12,'1_Risk_Calc'!$B$10:$B$109,0)))","v":""},{"$f":"IF($B12=0,\"\",INDEX('1_Risk_Calc'!S$10:S$109,MATCH('2_Alternatives'!$B12,'1_Risk_Calc'!$B$10:$B$109,0)))","v":""},{"$f":"IF($B12=0,\"\",INDEX('1_Risk_Calc'!T$10:T$109,MATCH('2_Alternatives'!$B12,'1_Risk_Calc'!$B$10:$B$109,0)))","v":""},{"$f":"IF($B12=0,\"\",INDEX('1_Risk_Calc'!U$10:U$109,MATCH('2_Alternatives'!$B12,'1_Risk_Calc'!$B$10:$B$109,0)))","v":""},{"$f":"IF($B12=0,\"\",INDEX('1_Risk_Calc'!V$10:V$109,MATCH('2_Alternatives'!$B12,'1_Risk_Calc'!$B$10:$B$109,0)))","v":""},{"$f":"IF($B12=0,\"\",INDEX('1_Risk_Calc'!W$10:W$109,MATCH('2_Alternatives'!$B12,'1_Risk_Calc'!$B$10:$B$109,0)))","v":""},{"$f":"IF($B12=0,\"\",INDEX('1_Risk_Calc'!X$10:X$109,MATCH('2_Alternatives'!$B12,'1_Risk_Calc'!$B$10:$B$109,0)))","v":""},{"$f":"IF($B12=0,\"\",INDEX('1_Risk_Calc'!Y$10:Y$109,MATCH('2_Alternatives'!$B12,'1_Risk_Calc'!$B$10:$B$109,0)))","v":""},{"$f":"IF($B12=0,\"\",INDEX('1_Risk_Calc'!Z$10:Z$109,MATCH('2_Alternatives'!$B12,'1_Risk_Calc'!$B$10:$B$109,0)))","v":""},{"$f":"IF($B12=0,\"\",INDEX('1_Risk_Calc'!AA$10:AA$109,MATCH('2_Alternatives'!$B12,'1_Risk_Calc'!$B$10:$B$109,0)))","v":""},{"$f":"IF($B12=0,\"\",INDEX('1_Risk_Calc'!AB$10:AB$109,MATCH('2_Alternatives'!$B12,'1_Risk_Calc'!$B$10:$B$109,0)))","v":""},{"$f":"IF($B12=0,\"\",INDEX('1_Risk_Calc'!AC$10:AC$109,MATCH('2_Alternatives'!$B12,'1_Risk_Calc'!$B$10:$B$109,0)))","v":""},"—","—","—",null,null,null,null,{"$f":"B12","v":0},{"$f":"AC12","v":""},null,null,1,{"$f":"B13","v":""},{"$f":"AD13","v":""},{"$f":"AQ12","v":""},{"$f":"IF(AND(ISTEXT(C13)=TRUE,ISNUMBER(E13)=FALSE),0,AF13)","v":""},{"$f":"IF(SUM($AC$13:$AC$20)=0,AO12,IF(COUNTIF(AS$11:AS11,AS12)>=1,RANK(AS12,AS$12:AS$25,1)+COUNTIF(AS$11:AS11,AS12),RANK(AS12,AS$12:AS$25,1)))","v":1},1,{"$f":"INDEX(AP$12:AP$25,MATCH(AU12,AT$12:AT$25,0))","v":""},null,{"$f":"INDEX(AQ$12:AQ$25,MATCH(AU12,AT$12:AT$25,0))","v":""},{"$f":"INDEX(AR$12:AR$25,MATCH(AU12,AT$12:AT$25,0))","v":""},{"$f":"IF(INDEX(AS$12:AS$25,MATCH(AU12,AT$12:AT$25,0))=\"\",0,INDEX(AS$12:AS$25,MATCH(AU12,AT$12:AT$25,0)))","v":0},{"$f":"SUM(AY$12:AY12)","v":0},null,{"$f":"AV12","v":""},0,{"$f":"SUM(AZ12)*2","v":0},{"$f":"IF(COUNTIF($BC$12:$BC12,$BC12)=3,0,IF($BC12=BF$11,INDEX($AZ$12:$AZ$25,MATCH(BF$11,$AV$12:$AV$25,0)),0))","v":0},{"$f":"IF(COUNTIF($BC$12:$BC12,$BC12)=3,0,IF($BC12=BG$11,INDEX($AZ$12:$AZ$25,MATCH(BG$11,$AV$12:$AV$25,0)),0))","v":0},{"$f":"IF(COUNTIF($BC$12:$BC12,$BC12)=3,0,IF($BC12=BH$11,INDEX($AZ$12:$AZ$25,MATCH(BH$11,$AV$12:$AV$25,0)),0))","v":0},{"$f":"IF(COUNTIF($BC$12:$BC12,$BC12)=3,0,IF($BC12=BI$11,INDEX($AZ$12:$AZ$25,MATCH(BI$11,$AV$12:$AV$25,0)),0))","v":0},{"$f":"IFERROR(IF(COUNTIF($BC$12:$BC12,$BC12)=3,0,IF($BC12=BJ$11,INDEX($AZ$12:$AZ$25,MATCH(BJ$11,$AV$12:$AV$25,0)),0)),0)","v":0},{"$f":"IFERROR(IF(COUNTIF($BC$12:$BC12,$BC12)=3,0,IF($BC12=BK$11,INDEX($AZ$12:$AZ$25,MATCH(BK$11,$AV$12:$AV$25,0)),0)),0)","v":0},{"$f":"IFERROR(IF(COUNTIF($BC$12:$BC12,$BC12)=3,0,IF($BC12=BL$11,INDEX($AZ$12:$AZ$25,MATCH(BL$11,$AV$12:$AV$25,0)),0)),0)","v":0},{"$f":"IFERROR(IF(COUNTIF($BC$12:$BC12,$BC12)=3,0,IF($BC12=BM$11,INDEX($AZ$12:$AZ$25,MATCH(BM$11,$AV$12:$AV$25,0)),0)),0)","v":0}]
[null,{"$f":"IF(B12=0,\"\",B12&\" - Alt. 1\")","v":""},null,null,null,null,null,null,null,null,null,null,null,null,null,null,{"$f":"IF(OR(F13=0,$E12=\"\"),\"\",INDEX(Risk_Factors!$O$12:$T$14,MATCH(F13,Frequency,0),MATCH($E12,Risk_Factors!$O$8:$T$8,0)))","v":""},{"$f":"IF(OR(G13=0,$E12=\"\"),\"\",INDEX(Risk_Factors!$O$15:$T$17,MATCH('2_Alternatives'!G13,Position,0),MATCH($E12,Risk_Factors!$O$8:$T$8,0)))","v":""},{"$f":"IF(OR(H13=0,$E12=\"\"),\"\",INDEX(Risk_Factors!$O$18:$T$19,MATCH('2_Alternatives'!H13,Yes_No,0),MATCH($E12,Risk_Factors!$O$8:$T$8,0)))","v":""},{"$f":"IF(OR(I13=0,$E12=\"\"),\"\",INDEX(Risk_Factors!$O$20:$T$22,MATCH('2_Alternatives'!I13,Dust_amount,0),MATCH($E12,Risk_Factors!$O$8:$T$8,0)))","v":""},{"$f":"IF(OR(J13=0,$E12=\"\"),\"\",INDEX(Risk_Factors!$O$23:$T$25,MATCH('2_Alternatives'!J13,Dust_composition,0),MATCH($E12,Risk_Factors!$O$8:$T$8,0)))","v":""},{"$f":"IF(OR(K13=0,$E12=\"\"),\"\",INDEX(Risk_Factors!$O$26:$T$28,MATCH('2_Alternatives'!K13,Dust_size,0),MATCH($E12,Risk_Factors!$O$8:$T$8,0)))","v":""},{"$f":"IF(OR(L13=0,$E12=\"\"),\"\",INDEX(Risk_Factors!$O$29:$T$30,MATCH('2_Alternatives'!L13,Risk_Factors!$E$29:$E$30,0),MATCH($E12,Risk_Factors!$O$8:$T$8,0)))","v":""},{"$f":"IF(OR(M13=0,$E12=\"\"),\"\",INDEX(Risk_Factors!$O$32:$T$33,MATCH('2_Alternatives'!M13,Risk_Factors!$E$32:$E$33,0),MATCH($E12,Risk_Factors!$O$8:$T$8,0)))","v":""},{"$f":"IF(OR(N13=0,$E12=\"\"),\"\",INDEX(Risk_Factors!$O$35:$T$36,MATCH('2_Alternatives'!N13,Risk_Factors!$E$35:$E$36,0),MATCH($E12,Risk_Factors!$O$8:$T$8,0)))","v":""},{"$f":"IF(OR(O13=0,$E12=\"\"),\"\",INDEX(Risk_Factors!$O$38:$T$39,MATCH('2_Alternatives'!O13,Risk_Factors!$E$38:$E$39,0),MATCH($E12,Risk_Factors!$O$8:$T$8,0)))","v":""},{"$f":"IF(OR(P13=0,$E12=\"\"),\"\",INDEX(Risk_Factors!$O$41:$T$42,MATCH('2_Alternatives'!P13,Risk_Factors!$E$41:$E$42,0),MATCH($E12,Risk_Factors!$O$8:$T$8,0)))","v":""},{"$f":"IFERROR(IF(SUM(Q13:AA13)=0,\"\",SUM(Q13:AA13)),\"\")","v":""},{"$f":"IF(OR(AB13=\"\",AC12=0),\"\",AC12*AB13/AB12)","v":""},{"$f":"IF(OR(AC12=\"\",AC12=0,AC13=\"\"),\"\",AC12-AC13)","v":""},{"$f":"IF(OR(AC12=\"\",AC12=0,AC13=\"\"),\"\",1-AC13/AC12)","v":""},{"$f":"IF(AND(ISTEXT(C13)=TRUE,ISNUMBER(E13)=FALSE),\"Insert Cost\",IF(OR(E13=0,AD13=0,AD13=\"\"),\"\",E13/AD13))","v":""},null,null,null,null,{"$f":"B13","v":""},{"$f":"AC13","v":""},null,null,2,"","","",{"$f":"IF(AND(ISTEXT(C14)=TRUE,ISNUMBER(E14)=FALSE),0,AF14)","v":""},{"$f":"IF(SUM($AC$13:$AC$20)=0,AO13,IF(AS13=\"\",MAX(AT$12:AT12)+1,IF(COUNTIF(AS$11:AS12,AS13)>=1,RANK(AS13,AS$12:AS$25,1)+COUNTIF(AS$11:AS12,AS13),RANK(AS13,AS$12:AS$25,1))))","v":2},{"$f":"AU12+1","v":2},"",null,"","",{"$f":"IF(INDEX(AS$12:AS$25,MATCH(AU13,AT$12:AT$25,0))=\"\",0,INDEX(AS$12:AS$25,MATCH(AU13,AT$12:AT$25,0)))","v":0},{"$f":"SUM(AY$12:AY13)","v":0},null,{"$f":"IF(COUNTIF(BC$11:BC12,BC12)=3,OFFSET($AV$12,(ROW(BC13)-ROW(BC$12))/3,0),BC12)","v":""},{"$f":"INDEX($BA$12:$BA$25,MATCH(BC12,$AV$12:$AV$25,0))","v":0},{"$f":"BE12","v":0},{"$f":"IF(COUNTIF($BC$12:$BC13,$BC13)=3,0,IF($BC13=BF$11,INDEX($AZ$12:$AZ$25,MATCH(BF$11,$AV$12:$AV$25,0)),0))","v":0},{"$f":"IF(COUNTIF($BC$12:$BC13,$BC13)=3,0,IF($BC13=BG$11,INDEX($AZ$12:$AZ$25,MATCH(BG$11,$AV$12:$AV$25,0)),0))","v":0},{"$f":"IF(COUNTIF($BC$12:$BC13,$BC13)=3,0,IF($BC13=BH$11,INDEX($AZ$12:$AZ$25,MATCH(BH$11,$AV$12:$AV$25,0)),0))","v":0},{"$f":"IF(COUNTIF($BC$12:$BC13,$BC13)=3,0,IF($BC13=BI$11,INDEX($AZ$12:$AZ$25,MATCH(BI$11,$AV$12:$AV$25,0)),0))","v":0},{"$f":"IFERROR(IF(COUNTIF($BC$12:$BC13,$BC13)=3,0,IF($BC13=BJ$11,INDEX($AZ$12:$AZ$25,MATCH(BJ$11,$AV$12:$AV$25,0)),0)),BJ12)","v":0},{"$f":"IFERROR(IF(COUNTIF($BC$12:$BC13,$BC13)=3,0,IF($BC13=BK$11,INDEX($AZ$12:$AZ$25,MATCH(BK$11,$AV$12:$AV$25,0)),0)),BK12)","v":0},{"$f":"IFERROR(IF(COUNTIF($BC$12:$BC13,$BC13)=3,0,IF($BC13=BL$11,INDEX($AZ$12:$AZ$25,MATCH(BL$11,$AV$12:$AV$25,0)),0)),BL12)","v":0},{"$f":"IFERROR(IF(COUNTIF($BC$12:$BC13,$BC13)=3,0,IF($BC13=BM$11,INDEX($AZ$12:$AZ$25,MATCH(BM$11,$AV$12:$AV$25,0)),0)),BM12)","v":0}]
[null,{"$f":"IF(B12=0,\"\",B12&\" - Alt. 2\")","v":""},null,null,null,null,null,null,null,null,null,null,null,null,null,null,{"$f":"IF(OR(F14=0,$E12=\"\"),\"\",INDEX(Risk_Factors!$O$12:$T$14,MATCH(F14,Frequency,0),MATCH($E12,Risk_Factors!$O$8:$T$8,0)))","v":""},{"$f":"IF(OR(G14=0,$E12=\"\"),\"\",INDEX(Risk_Factors!$O$15:$T$17,MATCH('2_Alternatives'!G14,Position,0),MATCH($E12,Risk_Factors!$O$8:$T$8,0)))","v":""},{"$f":"IF(OR(H14=0,$E12=\"\"),\"\",INDEX(Risk_Factors!$O$18:$T$19,MATCH('2_Alternatives'!H14,Yes_No,0),MATCH($E12,Risk_Factors!$O$8:$T$8,0)))","v":""},{"$f":"IF(OR(I14=0,$E12=\"\"),\"\",INDEX(Risk_Factors!$O$20:$T$22,MATCH('2_Alternatives'!I14,Dust_amount,0),MATCH($E12,Risk_Factors!$O$8:$T$8,0)))","v":""},{"$f":"IF(OR(J14=0,$E12=\"\"),\"\",INDEX(Risk_Factors!$O$23:$T$25,MATCH('2_Alternatives'!J14,Dust_composition,0),MATCH($E12,Risk_Factors!$O$8:$T$8,0)))","v":""},{"$f":"IF(OR(K14=0,$E12=\"\"),\"\",INDEX(Risk_Factors!$O$26:$T$28,MATCH('2_Alternatives'!K14,Dust_size,0),MATCH($E12,Risk_Factors!$O$8:$T$8,0)))","v":""},{"$f":"IF(OR(L14=0,$E12=\"\"),\"\",INDEX(Risk_Factors!$O$29:$T$30,MATCH('2_Alternatives'!L14,Risk_Factors!$E$29:$E$30,0),MATCH($E12,Risk_Factors!$O$8:$T$8,0)))","v":""},{"$f":"IF(OR(M14=0,$E12=\"\"),\"\",INDEX(Risk_Factors!$O$32:$T$33,MATCH('2_Alternatives'!M14,Risk_Factors!$E$32:$E$33,0),MATCH($E12,Risk_Factors!$O$8:$T$8,0)))","v":""},{"$f":"IF(OR(N14=0,$E12=\"\"),\"\",INDEX(Risk_Factors!$O$35:$T$36,MATCH('2_Alternatives'!N14,Risk_Factors!$E$35:$E$36,0),MATCH($E12,Risk_Factors!$O$8:$T$8,0)))","v":""},{"$f":"IF(OR(O14=0,$E12=\"\"),\"\",INDEX(Risk_Factors!$O$38:$T$39,MATCH('2_Alternatives'!O14,Risk_Factors!$E$38:$E$39,0),MATCH($E12,Risk_Factors!$O$8:$T$8,0)))","v":""},{"$f":"IF(OR(P14=0,$E12=\"\"),\"\",INDEX(Risk_Factors!$O$41:$T$42,MATCH('2_Alternatives'!P14,Risk_Factors!$E$41:$E$42,0),MATCH($E12,Risk_Factors!$O$8:$T$8,0)))","v":""},{"$f":"IFERROR(IF(SUM(Q14:AA14)=0,\"\",SUM(Q14:AA14)),\"\")","v":""},{"$f":"IF(OR(AB14=\"\",AC12=0),\"\",AC12*AB14/AB12)","v":""},{"$f":"IF(OR(AC12=\"\",AC12=0,AC14=\"\"),\"\",AC12-AC14)","v":""},{"$f":"IF(OR(AC12=\"\",AC12=0,AC14=\"\"),\"\",1-AC14/AC12)","v":""},{"$f":"IF(AND(ISTEXT(C14)=TRUE,ISNUMBER(E14)=FALSE),\"Insert Cost\",IF(OR(E14=0,AD14=0,AD14=\"\"),\"\",E14/AD14))","v":""},null,null,null,null,"","",null,null,3,"","","","",{"$f":"IF(SUM($AC$13:$AC$20)=0,AO14,IF(AS14=\"\",MAX(AT$12:AT13)+1,IF(COUNTIF(AS$11:AS13,AS14)>=1,RANK(AS14,AS$12:AS$25,1)+COUNTIF(AS$11:AS13,AS14),RANK(AS14,AS$12:AS$25,1))))","v":3},3,"",null,"","",0,{"$f":"SUM(AY$12:AY14)","v":0},null,{"$f":"IF(COUNTIF(BC$11:BC13,BC13)=3,OFFSET($AV$12,(ROW(BC14)-ROW(BC$12))/3,0),BC13)","v":""},0,{"$f":"BE13","v":0},{"$f":"IF(COUNTIF($BC$12:$BC14,$BC14)=3,0,IF($BC14=BF$11,INDEX($AZ$12:$AZ$25,MATCH(BF$11,$AV$12:$AV$25,0)),0))","v":0},{"$f":"IF(COUNTIF($BC$12:$BC14,$BC14)=3,0,IF($BC14=BG$11,INDEX($AZ$12:$AZ$25,MATCH(BG$11,$AV$12:$AV$25,0)),0))","v":0},{"$f":"IF(COUNTIF($BC$12:$BC14,$BC14)=3,0,IF($BC14=BH$11,INDEX($AZ$12:$AZ$25,MATCH(BH$11,$AV$12:$AV$25,0)),0))","v":0},{"$f":"IF(COUNTIF($BC$12:$BC14,$BC14)=3,0,IF($BC14=BI$11,INDEX($AZ$12:$AZ$25,MATCH(BI$11,$AV$12:$AV$25,0)),0))","v":0},{"$f":"IFERROR(IF(COUNTIF($BC$12:$BC14,$BC14)=3,0,IF($BC14=BJ$11,INDEX($AZ$12:$AZ$25,MATCH(BJ$11,$AV$12:$AV$25,0)),0)),BJ13)","v":0},{"$f":"IFERROR(IF(COUNTIF($BC$12:$BC14,$BC14)=3,0,IF($BC14=BK$11,INDEX($AZ$12:$AZ$25,MATCH(BK$11,$AV$12:$AV$25,0)),0)),BK13)","v":0},{"$f":"IFERROR(IF(COUNTIF($BC$12:$BC14,$BC14)=3,0,IF($BC14=BL$11,INDEX($AZ$12:$AZ$25,MATCH(BL$11,$AV$12:$AV$25,0)),0)),BL13)","v":0},{"$f":"IFERROR(IF(COUNTIF($BC$12:$BC14,$BC14)=3,0,IF($BC14=BM$11,INDEX($AZ$12:$AZ$25,MATCH(BM$11,$AV$12:$AV$25,0)),0)),BM13)","v":0}]
[null,{"$f":"IF(B12=0,\"\",B12&\" - Alt. 3\")","v":""},null,null,null,null,null,null,null,null,null,null,null,null,null,null,{"$f":"IF(OR(F15=0,$E12=\"\"),\"\",INDEX(Risk_Factors!$O$12:$T$14,MATCH(F15,Frequency,0),MATCH($E12,Risk_Factors!$O$8:$T$8,0)))","v":""},{"$f":"IF(OR(G15=0,$E12=\"\"),\"\",INDEX(Risk_Factors!$O$15:$T$17,MATCH('2_Alternatives'!G15,Position,0),MATCH($E12,Risk_Factors!$O$8:$T$8,0)))","v":""},{"$f":"IF(OR(H15=0,$E12=\"\"),\"\",INDEX(Risk_Factors!$O$18:$T$19,MATCH('2_Alternatives'!H15,Yes_No,0),MATCH($E12,Risk_Factors!$O$8:$T$8,0)))","v":""},{"$f":"IF(OR(I15=0,$E12=\"\"),\"\",INDEX(Risk_Factors!$O$20:$T$22,MATCH('2_Alternatives'!I15,Dust_amount,0),MATCH($E12,Risk_Factors!$O$8:$T$8,0)))","v":""},{"$f":"IF(OR(J15=0,$E12=\"\"),\"\",INDEX(Risk_Factors!$O$23:$T$25,MATCH('2_Alternatives'!J15,Dust_composition,0),MATCH($E12,Risk_Factors!$O$8:$T$8,0)))","v":""},{"$f":"IF(OR(K15=0,$E12=\"\"),\"\",INDEX(Risk_Factors!$O$26:$T$28,MATCH('2_Alternatives'!K15,Dust_size,0),MATCH($E12,Risk_Factors!$O$8:$T$8,0)))","v":""},{"$f":"IF(OR(L15=0,$E12=\"\"),\"\",INDEX(Risk_Factors!$O$29:$T$30,MATCH('2_Alternatives'!L15,Risk_Factors!$E$29:$E$30,0),MATCH($E12,Risk_Factors!$O$8:$T$8,0)))","v":""},{"$f":"IF(OR(M15=0,$E12=\"\"),\"\",INDEX(Risk_Factors!$O$32:$T$33,MATCH('2_Alternatives'!M15,Risk_Factors!$E$32:$E$33,0),MATCH($E12,Risk_Factors!$O$8:$T$8,0)))","v":""},{"$f":"IF(OR(N15=0,$E12=\"\"),\"\",INDEX(Risk_Factors!$O$35:$T$36,MATCH('2_Alternatives'!N15,Risk_Factors!$E$35:$E$36,0),MATCH($E12,Risk_Factors!$O$8:$T$8,0)))","v":""},{"$f":"IF(OR(O15=0,$E12=\"\"),\"\",INDEX(Risk_Factors!$O$38:$T$39,MATCH('2_Alternatives'!O15,Risk_Factors!$E$38:$E$39,0),MATCH($E12,Risk_Factors!$O$8:$T$8,0)))","v":""},{"$f":"IF(OR(P15=0,$E12=\"\"),\"\",INDEX(Risk_Factors!$O$41:$T$42,MATCH('2_Alternatives'!P15,Risk_Factors!$E$41:$E$42,0),MATCH($E12,Risk_Factors!$O$8:$T$8,0)))","v":""},"",{"$f":"IF(OR(AB15=\"\",AC12=0),\"\",AC12*AB15/AB12)","v":""},{"$f":"IF(OR(AC12=\"\",AC12=0,AC15=\"\"),\"\",AC12-AC15)","v":""},{"$f":"IF(OR(AC12=\"\",AC12=0,AC15=\"\"),\"\",1-AC15/AC12)","v":""},"",null,null,null,null,"","",null,null,4,"","","","",{"$f":"IF(SUM($AC$13:$AC$20)=0,AO15,IF(AS15=\"\",MAX(AT$12:AT14)+1,IF(COUNTIF(AS$11:AS14,AS15)>=1,RANK(AS15,AS$12:AS$25,1)+COUNTIF(AS$11:AS14,AS15),RANK(AS15,AS$12:AS$25,1))))","v":4},4,"",null,"","",0,{"$f":"SUM(AY$12:AY15)","v":0},null,{"$f":"IF(COUNTIF(BC$11:BC14,BC14)=3,OFFSET($AV$12,(ROW(BC15)-ROW(BC$12))/3,0),BC14)","v":""},0,0,{"$f":"IF(COUNTIF($BC$12:$BC15,$BC15)=3,0,IF($BC15=BF$11,INDEX($AZ$12:$AZ$25,MATCH(BF$11,$AV$12:$AV$25,0)),0))","v":0},{"$f":"IF(COUNTIF($BC$12:$BC15,$BC15)=3,0,IF($BC15=BG$11,INDEX($AZ$12:$AZ$25,MATCH(BG$11,$AV$12:$AV$25,0)),0))","v":0},{"$f":"IF(COUNTIF($BC$12:$BC15,$BC15)=3,0,IF($BC15=BH$11,INDEX($AZ$12:$AZ$25,MATCH(BH$11,$AV$12:$AV$25,0)),0))","v":0},{"$f":"IF(COUNTIF($BC$12:$BC15,$BC15)=3,0,IF($BC15=BI$11,INDEX($AZ$12:$AZ$25,MATCH(BI$11,$AV$12:$AV$25,0)),0))","v":0},{"$f":"IFERROR(IF(COUNTIF($BC$12:$BC15,$BC15)=3,0,IF($BC15=BJ$11,INDEX($AZ$12:$AZ$25,MATCH(BJ$11,$AV$12:$AV$25,0)),0)),BJ14)","v":0},{"$f":"IFERROR(IF(COUNTIF($BC$12:$BC15,$BC15)=3,0,IF($BC15=BK$11,INDEX($AZ$12:$AZ$25,MATCH(BK$11,$AV$12:$AV$25,0)),0)),BK14)","v":0},{"$f":"IFERROR(IF(COUNTIF($BC$12:$BC15,$BC15)=3,0,IF($BC15=BL$11,INDEX($AZ$12:$AZ$25,MATCH(BL$11,$AV$12:$AV$25,0)),0)),BL14)","v":0},{"$f":"IFERROR(IF(COUNTIF($BC$12:$BC15,$BC15)=3,0,IF($BC15=BM$11,INDEX($AZ$12:$AZ$25,MATCH(BM$11,$AV$12:$AV$25,0)),0)),BM14)","v":0}]
[null,{"$f":"IF(B12=0,\"\",B12&\" - Alt. 4\")","v":""},null,null,null,null,null,null,null,null,null,null,null,null,null,null,{"$f":"IF(OR(F16=0,$E12=\"\"),\"\",INDEX(Risk_Factors!$O$12:$T$14,MATCH(F16,Frequency,0),MATCH($E12,Risk_Factors!$O$8:$T$8,0)))","v":""},{"$f":"IF(OR(G16=0,$E12=\"\"),\"\",INDEX(Risk_Factors!$O$15:$T$17,MATCH('2_Alternatives'!G16,Position,0),MATCH($E12,Risk_Factors!$O$8:$T$8,0)))","v":""},{"$f":"IF(OR(H16=0,$E12=\"\"),\"\",INDEX(Risk_Factors!$O$18:$T$19,MATCH('2_Alternatives'!H16,Yes_No,0),MATCH($E12,Risk_Factors!$O$8:$T$8,0)))","v":""},{"$f":"IF(OR(I16=0,$E12=\"\"),\"\",INDEX(Risk_Factors!$O$20:$T$22,MATCH('2_Alternatives'!I16,Dust_amount,0),MATCH($E12,Risk_Factors!$O$8:$T$8,0)))","v":""},{"$f":"IF(OR(J16=0,$E12=\"\"),\"\",INDEX(Risk_Factors!$O$23:$T$25,MATCH('2_Alternatives'!J16,Dust_composition,0),MATCH($E12,Risk_Factors!$O$8:$T$8,0)))","v":""},{"$f":"IF(OR(K16=0,$E12=\"\"),\"\",INDEX(Risk_Factors!$O$26:$T$28,MATCH('2_Alternatives'!K16,Dust_size,0),MATCH($E12,Risk_Factors!$O$8:$T$8,0)))","v":""},{"$f":"IF(OR(L16=0,$E12=\"\"),\"\",INDEX(Risk_Factors!$O$29:$T$30,MATCH('2_Alternatives'!L16,Risk_Factors!$E$29:$E$30,0),MATCH($E12,Risk_Factors!$O$8:$T$8,0)))","v":""},{"$f":"IF(OR(M16=0,$E12=\"\"),\"\",INDEX(Risk_Factors!$O$32:$T$33,MATCH('2_Alternatives'!M16,Risk_Factors!$E$32:$E$33,0),MATCH($E12,Risk_Factors!$O$8:$T$8,0)))","v":""},{"$f":"IF(OR(N16=0,$E12=\"\"),\"\",INDEX(Risk_Factors!$O$35:$T$36,MATCH('2_Alternatives'!N16,Risk_Factors!$E$35:$E$36,0),MATCH($E12,Risk_Factors!$O$8:$T$8,0)))","v":""},{"$f":"IF(OR(O16=0,$E12=\"\"),\"\",INDEX(Risk_Factors!$O$38:$T$39,MATCH('2_Alternatives'!O16,Risk_Factors!$E$38:$E$39,0),MATCH($E12,Risk_Factors!$O$8:$T$8,0)))","v":""},{"$f":"IF(OR(P16=0,$E12=\"\"),\"\",INDEX(Risk_Factors!$O$41:$T$42,MATCH('2_Alternatives'!P16,Risk_Factors!$E$41:$E$42,0),MATCH($E12,Risk_Factors!$O$8:$T$8,0)))","v":""},"",{"$f":"IF(OR(AB16=\"\",AC12=0),\"\",AC12*AB16/AB12)","v":""},{"$f":"IF(OR(AC12=\"\",AC12=0,AC16=\"\"),\"\",AC12-AC16)","v":""},{"$f":"IF(OR(AC12=\"\",AC12=0,AC16=\"\"),\"\",1-AC16/AC12)","v":""},"",null,null,null,null,"","",null,null,5,"","","","",{"$f":"IF(SUM($AC$13:$AC$20)=0,AO16,IF(AS16=\"\",MAX(AT$12:AT15)+1,IF(COUNTIF(AS$11:AS15,AS16)>=1,RANK(AS16,AS$12:AS$25,1)+COUNTIF(AS$11:AS15,AS16),RANK(AS16,AS$12:AS$25,1))))","v":5},5,"",null,"","",0,{"$f":"SUM(AY$12:AY16)","v":0},null,{"$f":"IF(COUNTIF(BC$11:BC15,BC15)=3,OFFSET($AV$12,(ROW(BC16)-ROW(BC$12))/3,0),BC15)","v":""},0,0,{"$f":"IF(COUNTIF($BC$12:$BC16,$BC16)=3,0,IF($BC16=BF$11,INDEX($AZ$12:$AZ$25,MATCH(BF$11,$AV$12:$AV$25,0)),0))","v":0},{"$f":"IF(COUNTIF($BC$12:$BC16,$BC16)=3,0,IF($BC16=BG$11,INDEX($AZ$12:$AZ$25,MATCH(BG$11,$AV$12:$AV$25,0)),0))","v":0},{"$f":"IF(COUNTIF($BC$12:$BC16,$BC16)=3,0,IF($BC16=BH$11,INDEX($AZ$12:$AZ$25,MATCH(BH$11,$AV$12:$AV$25,0)),0))","v":0},{"$f":"IF(COUNTIF($BC$12:$BC16,$BC16)=3,0,IF($BC16=BI$11,INDEX($AZ$12:$AZ$25,MATCH(BI$11,$AV$12:$AV$25,0)),0))","v":0},{"$f":"IFERROR(IF(COUNTIF($BC$12:$BC16,$BC16)=3,0,IF($BC16=BJ$11,INDEX($AZ$12:$AZ$25,MATCH(BJ$11,$AV$12:$AV$25,0)),0)),BJ15)","v":0},{"$f":"IFERROR(IF(COUNTIF($BC$12:$BC16,$BC16)=3,0,IF($BC16=BK$11,INDEX($AZ$12:$AZ$25,MATCH(BK$11,$AV$12:$AV$25,0)),0)),BK15)","v":0},{"$f":"IFERROR(IF(COUNTIF($BC$12:$BC16,$BC16)=3,0,IF($BC16=BL$11,INDEX($AZ$12:$AZ$25,MATCH(BL$11,$AV$12:$AV$25,0)),0)),BL15)","v":0},{"$f":"IFERROR(IF(COUNTIF($BC$12:$BC16,$BC16)=3,0,IF($BC16=BM$11,INDEX($AZ$12:$AZ$25,MATCH(BM$11,$AV$12:$AV$25,0)),0)),BM15)","v":0}]
[null,{"$f":"IF(B12=0,\"\",B12&\" - Alt. 5\")","v":""},null,null,null,null,null,null,null,null,null,null,null,null,null,null,{"$f":"IF(OR(F17=0,$E12=\"\"),\"\",INDEX(Risk_Factors!$O$12:$T$14,MATCH(F17,Frequency,0),MATCH($E12,Risk_Factors!$O$8:$T$8,0)))","v":""},{"$f":"IF(OR(G17=0,$E12=\"\"),\"\",INDEX(Risk_Factors!$O$15:$T$17,MATCH('2_Alternatives'!G17,Position,0),MATCH($E12,Risk_Factors!$O$8:$T$8,0)))","v":""},{"$f":"IF(OR(H17=0,$E12=\"\"),\"\",INDEX(Risk_Factors!$O$18:$T$19,MATCH('2_Alternatives'!H17,Yes_No,0),MATCH($E12,Risk_Factors!$O$8:$T$8,0)))","v":""},{"$f":"IF(OR(I17=0,$E12=\"\"),\"\",INDEX(Risk_Factors!$O$20:$T$22,MATCH('2_Alternatives'!I17,Dust_amount,0),MATCH($E12,Risk_Factors!$O$8:$T$8,0)))","v":""},{"$f":"IF(OR(J17=0,$E12=\"\"),\"\",INDEX(Risk_Factors!$O$23:$T$25,MATCH('2_Alternatives'!J17,Dust_composition,0),MATCH($E12,Risk_Factors!$O$8:$T$8,0)))","v":""},{"$f":"IF(OR(K17=0,$E12=\"\"),\"\",INDEX(Risk_Factors!$O$26:$T$28,MATCH('2_Alternatives'!K17,Dust_size,0),MATCH($E12,Risk_Factors!$O$8:$T$8,0)))","v":""},{"$f":"IF(OR(L17=0,$E12=\"\"),\"\",INDEX(Risk_Factors!$O$29:$T$30,MATCH('2_Alternatives'!L17,Risk_Factors!$E$29:$E$30,0),MATCH($E12,Risk_Factors!$O$8:$T$8,0)))","v":""},{"$f":"IF(OR(M17=0,$E12=\"\"),\"\",INDEX(Risk_Factors!$O$32:$T$33,MATCH('2_Alternatives'!M17,Risk_Factors!$E$32:$E$33,0),MATCH($E12,Risk_Factors!$O$8:$T$8,0)))","v":""},{"$f":"IF(OR(N17=0,$E12=\"\"),\"\",INDEX(Risk_Factors!$O$35:$T$36,MATCH('2_Alternatives'!N17,Risk_Factors!$E$35:$E$36,0),MATCH($E12,Risk_Factors!$O$8:$T$8,0)))","v":""},{"$f":"IF(OR(O17=0,$E12=\"\"),\"\",INDEX(Risk_Factors!$O$38:$T$39,MATCH('2_Alternatives'!O17,Risk_Factors!$E$38:$E$39,0),MATCH($E12,Risk_Factors!$O$8:$T$8,0)))","v":""},{"$f":"IF(OR(P17=0,$E12=\"\"),\"\",INDEX(Risk_Factors!$O$41:$T$42,MATCH('2_Alternatives'!P17,Risk_Factors!$E$41:$E$42,0),MATCH($E12,Risk_Factors!$O$8:$T$8,0)))","v":""},"",{"$f":"IF(OR(AB17=\"\",AC12=0),\"\",AC12*AB17/AB12)","v":""},{"$f":"IF(OR(AC12=\"\",AC12=0,AC17=\"\"),\"\",AC12-AC17)","v":""},{"$f":"IF(OR(AC12=\"\",AC12=0,AC17=\"\"),\"\",1-AC17/AC12)","v":""},"",null,null,null,null,"","",null,null,6,"","","","",{"$f":"IF(SUM($AC$13:$AC$20)=0,AO17,IF(AS17=\"\",MAX(AT$12:AT16)+1,IF(COUNTIF(AS$11:AS16,AS17)>=1,RANK(AS17,AS$12:AS$25,1)+COUNTIF(AS$11:AS16,AS17),RANK(AS17,AS$12:AS$25,1))))","v":6},6,"",null,"","",0,{"$f":"SUM(AY$12:AY17)","v":0},null,{"$f":"IF(COUNTIF(BC$11:BC16,BC16)=3,OFFSET($AV$12,(ROW(BC17)-ROW(BC$12))/3,0),BC16)","v":""},0,0,{"$f":"IF(COUNTIF($BC$12:$BC17,$BC17)=3,0,IF($BC17=BF$11,INDEX($AZ$12:$AZ$25,MATCH(BF$11,$AV$12:$AV$25,0)),0))","v":0},{"$f":"IF(COUNTIF($BC$12:$BC17,$BC17)=3,0,IF($BC17=BG$11,INDEX($AZ$12:$AZ$25,MATCH(BG$11,$AV$12:$AV$25,0)),0))","v":0},{"$f":"IF(COUNTIF($BC$12:$BC17,$BC17)=3,0,IF($BC17=BH$11,INDEX($AZ$12:$AZ$25,MATCH(BH$11,$AV$12:$AV$25,0)),0))","v":0},{"$f":"IF(COUNTIF($BC$12:$BC17,$BC17)=3,0,IF($BC17=BI$11,INDEX($AZ$12:$AZ$25,MATCH(BI$11,$AV$12:$AV$25,0)),0))","v":0},{"$f":"IFERROR(IF(COUNTIF($BC$12:$BC17,$BC17)=3,0,IF($BC17=BJ$11,INDEX($AZ$12:$AZ$25,MATCH(BJ$11,$AV$12:$AV$25,0)),0)),BJ16)","v":0},{"$f":"IFERROR(IF(COUNTIF($BC$12:$BC17,$BC17)=3,0,IF($BC17=BK$11,INDEX($AZ$12:$AZ$25,MATCH(BK$11,$AV$12:$AV$25,0)),0)),BK16)","v":0},{"$f":"IFERROR(IF(COUNTIF($BC$12:$BC17,$BC17)=3,0,IF($BC17=BL$11,INDEX($AZ$12:$AZ$25,MATCH(BL$11,$AV$12:$AV$25,0)),0)),BL16)","v":0},{"$f":"IFERROR(IF(COUNTIF($BC$12:$BC17,$BC17)=3,0,IF($BC17=BM$11,INDEX($AZ$12:$AZ$25,MATCH(BM$11,$AV$12:$AV$25,0)),0)),BM16)","v":0}]
[null,{"$f":"IF(B12=0,\"\",B12&\" - Alt. 6\")","v":""},null,null,null,null,null,null,null,null,null,null,null,null,null,null,{"$f":"IF(OR(F18=0,$E12=\"\"),\"\",INDEX(Risk_Factors!$O$12:$T$14,MATCH(F18,Frequency,0),MATCH($E12,Risk_Factors!$O$8:$T$8,0)))","v":""},{"$f":"IF(OR(G18=0,$E12=\"\"),\"\",INDEX(Risk_Factors!$O$15:$T$17,MATCH('2_Alternatives'!G18,Position,0),MATCH($E12,Risk_Factors!$O$8:$T$8,0)))","v":""},{"$f":"IF(OR(H18=0,$E12=\"\"),\"\",INDEX(Risk_Factors!$O$18:$T$19,MATCH('2_Alternatives'!H18,Yes_No,0),MATCH($E12,Risk_Factors!$O$8:$T$8,0)))","v":""},{"$f":"IF(OR(I18=0,$E12=\"\"),\"\",INDEX(Risk_Factors!$O$20:$T$22,MATCH('2_Alternatives'!I18,Dust_amount,0),MATCH($E12,Risk_Factors!$O$8:$T$8,0)))","v":""},{"$f":"IF(OR(J18=0,$E12=\"\"),\"\",INDEX(Risk_Factors!$O$23:$T$25,MATCH('2_Alternatives'!J18,Dust_composition,0),MATCH($E12,Risk_Factors!$O$8:$T$8,0)))","v":""},{"$f":"IF(OR(K18=0,$E12=\"\"),\"\",INDEX(Risk_Factors!$O$26:$T$28,MATCH('2_Alternatives'!K18,Dust_size,0),MATCH($E12,Risk_Factors!$O$8:$T$8,0)))","v":""},{"$f":"IF(OR(L18=0,$E12=\"\"),\"\",INDEX(Risk_Factors!$O$29:$T$30,MATCH('2_Alternatives'!L18,Risk_Factors!$E$29:$E$30,0),MATCH($E12,Risk_Factors!$O$8:$T$8,0)))","v":""},{"$f":"IF(OR(M18=0,$E12=\"\"),\"\",INDEX(Risk_Factors!$O$32:$T$33,MATCH('2_Alternatives'!M18,Risk_Factors!$E$32:$E$33,0),MATCH($E12,Risk_Factors!$O$8:$T$8,0)))","v":""},{"$f":"IF(OR(N18=0,$E12=\"\"),\"\",INDEX(Risk_Factors!$O$35:$T$36,MATCH('2_Alternatives'!N18,Risk_Factors!$E$35:$E$36,0),MATCH($E12,Risk_Factors!$O$8:$T$8,0)))","v":""},{"$f":"IF(OR(O18=0,$E12=\"\"),\"\",INDEX(Risk_Factors!$O$38:$T$39,MATCH('2_Alternatives'!O18,Risk_Factors!$E$38:$E$39,0),MATCH($E12,Risk_Factors!$O$8:$T$8,0)))","v":""},{"$f":"IF(OR(P18=0,$E12=\"\"),\"\",INDEX(Risk_Factors!$O$41:$T$42,MATCH('2_Alternatives'!P18,Risk_Factors!$E$41:$E$42,0),MATCH($E12,Risk_Factors!$O$8:$T$8,0)))","v":""},"",{"$f":"IF(OR(AB18=\"\",AC12=0),\"\",AC12*AB18/AB12)","v":""},{"$f":"IF(OR(AC12=\"\",AC12=0,AC18=\"\"),\"\",AC12-AC18)","v":""},{"$f":"IF(OR(AC12=\"\",AC12=0,AC18=\"\"),\"\",1-AC18/AC12)","v":""},"",null,null,null,null,"","",null,null,7,"","","","",{"$f":"IF(SUM($AC$13:$AC$20)=0,AO18,IF(AS18=\"\",MAX(AT$12:AT17)+1,IF(COUNTIF(AS$11:AS17,AS18)>=1,RANK(AS18,AS$12:AS$25,1)+COUNTIF(AS$11:AS17,AS18),RANK(AS18,AS$12:AS$25,1))))","v":7},7,"",null,"","",0,{"$f":"SUM(AY$12:AY18)","v":0},null,{"$f":"IF(COUNTIF(BC$11:BC17,BC17)=3,OFFSET($AV$12,(ROW(BC18)-ROW(BC$12))/3,0),BC17)","v":""},0,0,{"$f":"IF(COUNTIF($BC$12:$BC18,$BC18)=3,0,IF($BC18=BF$11,INDEX($AZ$12:$AZ$25,MATCH(BF$11,$AV$12:$AV$25,0)),0))","v":0},{"$f":"IF(COUNTIF($BC$12:$BC18,$BC18)=3,0,IF($BC18=BG$11,INDEX($AZ$12:$AZ$25,MATCH(BG$11,$AV$12:$AV$25,0)),0))","v":0},{"$f":"IF(COUNTIF($BC$12:$BC18,$BC18)=3,0,IF($BC18=BH$11,INDEX($AZ$12:$AZ$25,MATCH(BH$11,$AV$12:$AV$25,0)),0))","v":0},{"$f":"IF(COUNTIF($BC$12:$BC18,$BC18)=3,0,IF($BC18=BI$11,INDEX($AZ$12:$AZ$25,MATCH(BI$11,$AV$12:$AV$25,0)),0))","v":0},{"$f":"IFERROR(IF(COUNTIF($BC$12:$BC18,$BC18)=3,0,IF($BC18=BJ$11,INDEX($AZ$12:$AZ$25,MATCH(BJ$11,$AV$12:$AV$25,0)),0)),BJ17)","v":0},{"$f":"IFERROR(IF(COUNTIF($BC$12:$BC18,$BC18)=3,0,IF($BC18=BK$11,INDEX($AZ$12:$AZ$25,MATCH(BK$11,$AV$12:$AV$25,0)),0)),BK17)","v":0},{"$f":"IFERROR(IF(COUNTIF($BC$12:$BC18,$BC18)=3,0,IF($BC18=BL$11,INDEX($AZ$12:$AZ$25,MATCH(BL$11,$AV$12:$AV$25,0)),0)),BL17)","v":0},{"$f":"IFERROR(IF(COUNTIF($BC$12:$BC18,$BC18)=3,0,IF($BC18=BM$11,INDEX($AZ$12:$AZ$25,MATCH(BM$11,$AV$12:$AV$25,0)),0)),BM17)","v":0}]
[null,{"$f":"IF(B12=0,\"\",B12&\" - Alt. 7\")","v":""},null,null,null,null,null,null,null,null,null,null,null,null,null,null,{"$f":"IF(OR(F19=0,$E12=\"\"),\"\",INDEX(Risk_Factors!$O$12:$T$14,MATCH(F19,Frequency,0),MATCH($E12,Risk_Factors!$O$8:$T$8,0)))","v":""},{"$f":"IF(OR(G19=0,$E12=\"\"),\"\",INDEX(Risk_Factors!$O$15:$T$17,MATCH('2_Alternatives'!G19,Position,0),MATCH($E12,Risk_Factors!$O$8:$T$8,0)))","v":""},{"$f":"IF(OR(H19=0,$E12=\"\"),\"\",INDEX(Risk_Factors!$O$18:$T$19,MATCH('2_Alternatives'!H19,Yes_No,0),MATCH($E12,Risk_Factors!$O$8:$T$8,0)))","v":""},{"$f":"IF(OR(I19=0,$E12=\"\"),\"\",INDEX(Risk_Factors!$O$20:$T$22,MATCH('2_Alternatives'!I19,Dust_amount,0),MATCH($E12,Risk_Factors!$O$8:$T$8,0)))","v":""},{"$f":"IF(OR(J19=0,$E12=\"\"),\"\",INDEX(Risk_Factors!$O$23:$T$25,MATCH('2_Alternatives'!J19,Dust_composition,0),MATCH($E12,Risk_Factors!$O$8:$T$8,0)))","v":""},{"$f":"IF(OR(K19=0,$E12=\"\"),\"\",INDEX(Risk_Factors!$O$26:$T$28,MATCH('2_Alternatives'!K19,Dust_size,0),MATCH($E12,Risk_Factors!$O$8:$T$8,0)))","v":""},{"$f":"IF(OR(L19=0,$E12=\"\"),\"\",INDEX(Risk_Factors!$O$29:$T$30,MATCH('2_Alternatives'!L19,Risk_Factors!$E$29:$E$30,0),MATCH($E12,Risk_Factors!$O$8:$T$8,0)))","v":""},{"$f":"IF(OR(M19=0,$E12=\"\"),\"\",INDEX(Risk_Factors!$O$32:$T$33,MATCH('2_Alternatives'!M19,Risk_Factors!$E$32:$E$33,0),MATCH($E12,Risk_Factors!$O$8:$T$8,0)))","v":""},{"$f":"IF(OR(N19=0,$E12=\"\"),\"\",INDEX(Risk_Factors!$O$35:$T$36,MATCH('2_Alternatives'!N19,Risk_Factors!$E$35:$E$36,0),MATCH($E12,Risk_Factors!$O$8:$T$8,0)))","v":""},{"$f":"IF(OR(O19=0,$E12=\"\"),\"\",INDEX(Risk_Factors!$O$38:$T$39,MATCH('2_Alternatives'!O19,Risk_Factors!$E$38:$E$39,0),MATCH($E12,Risk_Factors!$O$8:$T$8,0)))","v":""},{"$f":"IF(OR(P19=0,$E12=\"\"),\"\",INDEX(Risk_Factors!$O$41:$T$42,MATCH('2_Alternatives'!P19,Risk_Factors!$E$41:$E$42,0),MATCH($E12,Risk_Factors!$O$8:$T$8,0)))","v":""},"",{"$f":"IF(OR(AB19=\"\",AC12=0),\"\",AC12*AB19/AB12)","v":""},{"$f":"IF(OR(AC12=\"\",AC12=0,AC19=\"\"),\"\",AC12-AC19)","v":""},{"$f":"IF(OR(AC12=\"\",AC12=0,AC19=\"\"),\"\",1-AC19/AC12)","v":""},"",null,null,null,null,"","",null,null,8,"","","","",{"$f":"IF(SUM($AC$13:$AC$20)=0,AO19,IF(AS19=\"\",MAX(AT$12:AT18)+1,IF(COUNTIF(AS$11:AS18,AS19)>=1,RANK(AS19,AS$12:AS$25,1)+COUNTIF(AS$11:AS18,AS19),RANK(AS19,AS$12:AS$25,1))))","v":8},8,"",null,"","",0,{"$f":"SUM(AY$12:AY19)","v":0},null,{"$f":"IF(COUNTIF(BC$11:BC18,BC18)=3,OFFSET($AV$12,(ROW(BC19)-ROW(BC$12))/3,0),BC18)","v":""},0,0,{"$f":"IF(COUNTIF($BC$12:$BC19,$BC19)=3,0,IF($BC19=BF$11,INDEX($AZ$12:$AZ$25,MATCH(BF$11,$AV$12:$AV$25,0)),0))","v":0},{"$f":"IF(COUNTIF($BC$12:$BC19,$BC19)=3,0,IF($BC19=BG$11,INDEX($AZ$12:$AZ$25,MATCH(BG$11,$AV$12:$AV$25,0)),0))","v":0},{"$f":"IF(COUNTIF($BC$12:$BC19,$BC19)=3,0,IF($BC19=BH$11,INDEX($AZ$12:$AZ$25,MATCH(BH$11,$AV$12:$AV$25,0)),0))","v":0},{"$f":"IF(COUNTIF($BC$12:$BC19,$BC19)=3,0,IF($BC19=BI$11,INDEX($AZ$12:$AZ$25,MATCH(BI$11,$AV$12:$AV$25,0)),0))","v":0},{"$f":"IFERROR(IF(COUNTIF($BC$12:$BC19,$BC19)=3,0,IF($BC19=BJ$11,INDEX($AZ$12:$AZ$25,MATCH(BJ$11,$AV$12:$AV$25,0)),0)),BJ18)","v":0},{"$f":"IFERROR(IF(COUNTIF($BC$12:$BC19,$BC19)=3,0,IF($BC19=BK$11,INDEX($AZ$12:$AZ$25,MATCH(BK$11,$AV$12:$AV$25,0)),0)),BK18)","v":0},{"$f":"IFERROR(IF(COUNTIF($BC$12:$BC19,$BC19)=3,0,IF($BC19=BL$11,INDEX($AZ$12:$AZ$25,MATCH(BL$11,$AV$12:$AV$25,0)),0)),BL18)","v":0},{"$f":"IFERROR(IF(COUNTIF($BC$12:$BC19,$BC19)=3,0,IF($BC19=BM$11,INDEX($AZ$12:$AZ$25,MATCH(BM$11,$AV$12:$AV$25,0)),0)),BM18)","v":0}]
[null,{"$f":"IF(B12=0,\"\",B12&\" - Alt. 8\")","v":""},null,null,null,null,null,null,null,null,null,null,null,null,null,null,{"$f":"IF(OR(F20=0,$E12=\"\"),\"\",INDEX(Risk_Factors!$O$12:$T$14,MATCH(F20,Frequency,0),MATCH($E12,Risk_Factors!$O$8:$T$8,0)))","v":""},{"$f":"IF(OR(G20=0,$E12=\"\"),\"\",INDEX(Risk_Factors!$O$15:$T$17,MATCH('2_Alternatives'!G20,Position,0),MATCH($E12,Risk_Factors!$O$8:$T$8,0)))","v":""},{"$f":"IF(OR(H20=0,$E12=\"\"),\"\",INDEX(Risk_Factors!$O$18:$T$19,MATCH('2_Alternatives'!H20,Yes_No,0),MATCH($E12,Risk_Factors!$O$8:$T$8,0)))","v":""},{"$f":"IF(OR(I20=0,$E12=\"\"),\"\",INDEX(Risk_Factors!$O$20:$T$22,MATCH('2_Alternatives'!I20,Dust_amount,0),MATCH($E12,Risk_Factors!$O$8:$T$8,0)))","v":""},{"$f":"IF(OR(J20=0,$E12=\"\"),\"\",INDEX(Risk_Factors!$O$23:$T$25,MATCH('2_Alternatives'!J20,Dust_composition,0),MATCH($E12,Risk_Factors!$O$8:$T$8,0)))","v":""},{"$f":"IF(OR(K20=0,$E12=\"\"),\"\",INDEX(Risk_Factors!$O$26:$T$28,MATCH('2_Alternatives'!K20,Dust_size,0),MATCH($E12,Risk_Factors!$O$8:$T$8,0)))","v":""},{"$f":"IF(OR(L20=0,$E12=\"\"),\"\",INDEX(Risk_Factors!$O$29:$T$30,MATCH('2_Alternatives'!L20,Risk_Factors!$E$29:$E$30,0),MATCH($E12,Risk_Factors!$O$8:$T$8,0)))","v":""},{"$f":"IF(OR(M20=0,$E12=\"\"),\"\",INDEX(Risk_Factors!$O$32:$T$33,MATCH('2_Alternatives'!M20,Risk_Factors!$E$32:$E$33,0),MATCH($E12,Risk_Factors!$O$8:$T$8,0)))","v":""},{"$f":"IF(OR(N20=0,$E12=\"\"),\"\",INDEX(Risk_Factors!$O$35:$T$36,MATCH('2_Alternatives'!N20,Risk_Factors!$E$35:$E$36,0),MATCH($E12,Risk_Factors!$O$8:$T$8,0)))","v":""},{"$f":"IF(OR(O20=0,$E12=\"\"),\"\",INDEX(Risk_Factors!$O$38:$T$39,MATCH('2_Alternatives'!O20,Risk_Factors!$E$38:$E$39,0),MATCH($E12,Risk_Factors!$O$8:$T$8,0)))","v":""},{"$f":"IF(OR(P20=0,$E12=\"\"),\"\",INDEX(Risk_Factors!$O$41:$T$42,MATCH('2_Alternatives'!P20,Risk_Factors!$E$41:$E$42,0),MATCH($E12,Risk_Factors!$O$8:$T$8,0)))","v":""},"",{"$f":"IF(OR(AB20=\"\",AC12=0),\"\",AC12*AB20/AB12)","v":""},{"$f":"IF(OR(AC12=\"\",AC12=0,AC20=\"\"),\"\",AC12-AC20)","v":""},{"$f":"IF(OR(AC12=\"\",AC12=0,AC20=\"\"),\"\",1-AC20/AC12)","v":""},"",null,null,null,null,"","",null,null,null,null,null,null,null,null,null,null,null,null,null,null,null,null,{"$f":"IF(COUNTIF(BC$11:BC19,BC19)=3,OFFSET($AV$12,(ROW(BC20)-ROW(BC$12))/3,0),BC19)","v":""},0,0,{"$f":"IF(COUNTIF($BC$12:$BC20,$BC20)=3,0,IF($BC20=BF$11,INDEX($AZ$12:$AZ$25,MATCH(BF$11,$AV$12:$AV$25,0)),0))","v":0},{"$f":"IF(COUNTIF($BC$12:$BC20,$BC20)=3,0,IF($BC20=BG$11,INDEX($AZ$12:$AZ$25,MATCH(BG$11,$AV$12:$AV$25,0)),0))","v":0},{"$f":"IF(COUNTIF($BC$12:$BC20,$BC20)=3,0,IF($BC20=BH$11,INDEX($AZ$12:$AZ$25,MATCH(BH$11,$AV$12:$AV$25,0)),0))","v":0},{"$f":"IF(COUNTIF($BC$12:$BC20,$BC20)=3,0,IF($BC20=BI$11,INDEX($AZ$12:$AZ$25,MATCH(BI$11,$AV$12:$AV$25,0)),0))","v":0},{"$f":"IFERROR(IF(COUNTIF($BC$12:$BC20,$BC20)=3,0,IF($BC20=BJ$11,INDEX($AZ$12:$AZ$25,MATCH(BJ$11,$AV$12:$AV$25,0)),0)),BJ19)","v":0},{"$f":"IFERROR(IF(COUNTIF($BC$12:$BC20,$BC20)=3,0,IF($BC20=BK$11,INDEX($AZ$12:$AZ$25,MATCH(BK$11,$AV$12:$AV$25,0)),0)),BK19)","v":0},{"$f":"IFERROR(IF(COUNTIF($BC$12:$BC20,$BC20)=3,0,IF($BC20=BL$11,INDEX($AZ$12:$AZ$25,MATCH(BL$11,$AV$12:$AV$25,0)),0)),BL19)","v":0},{"$f":"IFERROR(IF(COUNTIF($BC$12:$BC20,$BC20)=3,0,IF($BC20=BM$11,INDEX($AZ$12:$AZ$25,MATCH(BM$11,$AV$12:$AV$25,0)),0)),BM19)","v":0}]
[null,null,null,null,null,null,null,null,null,null,null,null,null,null,null,null,null,null,null,null,null,null,null,null,null,null,null,null,null,null,null,null,null,null,null,null,null,null,null,null,null,null,null,null,null,null,null,null,null,null,null,null,null,null,{"$f":"IF(COUNTIF(BC$11:BC20,BC20)=3,OFFSET($AV$12,(ROW(BC21)-ROW(BC$12))/3,0),BC20)","v":""},0,0,{"$f":"IF(COUNTIF($BC$12:$BC21,$BC21)=3,0,IF($BC21=BF$11,INDEX($AZ$12:$AZ$25,MATCH(BF$11,$AV$12:$AV$25,0)),0))","v":0},{"$f":"IF(COUNTIF($BC$12:$BC21,$BC21)=3,0,IF($BC21=BG$11,INDEX($AZ$12:$AZ$25,MATCH(BG$11,$AV$12:$AV$25,0)),0))","v":0},{"$f":"IF(COUNTIF($BC$12:$BC21,$BC21)=3,0,IF($BC21=BH$11,INDEX($AZ$12:$AZ$25,MATCH(BH$11,$AV$12:$AV$25,0)),0))","v":0},{"$f":"IF(COUNTIF($BC$12:$BC21,$BC21)=3,0,IF($BC21=BI$11,INDEX($AZ$12:$AZ$25,MATCH(BI$11,$AV$12:$AV$25,0)),0))","v":0},{"$f":"IFERROR(IF(COUNTIF($BC$12:$BC21,$BC21)=3,0,IF($BC21=BJ$11,INDEX($AZ$12:$AZ$25,MATCH(BJ$11,$AV$12:$AV$25,0)),0)),BJ20)","v":0},{"$f":"IFERROR(IF(COUNTIF($BC$12:$BC21,$BC21)=3,0,IF($BC21=BK$11,INDEX($AZ$12:$AZ$25,MATCH(BK$11,$AV$12:$AV$25,0)),0)),BK20)","v":0},{"$f":"IFERROR(IF(COUNTIF($BC$12:$BC21,$BC21)=3,0,IF($BC21=BL$11,INDEX($AZ$12:$AZ$25,MATCH(BL$11,$AV$12:$AV$25,0)),0)),BL20)","v":0},{"$f":"IFERROR(IF(COUNTIF($BC$12:$BC21,$BC21)=3,0,IF($BC21=BM$11,INDEX($AZ$12:$AZ$25,MATCH(BM$11,$AV$12:$AV$25,0)),0)),BM20)","v":0}]
[null,null,null,null,null,null,null,null,null,null,null,null,null,null,null,null,null,null,null,null,null,null,null,null,null,null,null,null,null,null,null,null,null,null,null,null,null,null,null,null,null,null,null,null,null,null,null,null,null,null,null,null,null,null,{"$f":"IF(COUNTIF(BC$11:BC21,BC21)=3,OFFSET($AV$12,(ROW(BC22)-ROW(BC$12))/3,0),BC21)","v":""},0,0,{"$f":"IF(COUNTIF($BC$12:$BC22,$BC22)=3,0,IF($BC22=BF$11,INDEX($AZ$12:$AZ$25,MATCH(BF$11,$AV$12:$AV$25,0)),0))","v":0},{"$f":"IF(COUNTIF($BC$12:$BC22,$BC22)=3,0,IF($BC22=BG$11,INDEX($AZ$12:$AZ$25,MATCH(BG$11,$AV$12:$AV$25,0)),0))","v":0},{"$f":"IF(COUNTIF($BC$12:$BC22,$BC22)=3,0,IF($BC22=BH$11,INDEX($AZ$12:$AZ$25,MATCH(BH$11,$AV$12:$AV$25,0)),0))","v":0},{"$f":"IF(COUNTIF($BC$12:$BC22,$BC22)=3,0,IF($BC22=BI$11,INDEX($AZ$12:$AZ$25,MATCH(BI$11,$AV$12:$AV$25,0)),0))","v":0},{"$f":"IFERROR(IF(COUNTIF($BC$12:$BC22,$BC22)=3,0,IF($BC22=BJ$11,INDEX($AZ$12:$AZ$25,MATCH(BJ$11,$AV$12:$AV$25,0)),0)),BJ21)","v":0},{"$f":"IFERROR(IF(COUNTIF($BC$12:$BC22,$BC22)=3,0,IF($BC22=BK$11,INDEX($AZ$12:$AZ$25,MATCH(BK$11,$AV$12:$AV$25,0)),0)),BK21)","v":0},{"$f":"IFERROR(IF(COUNTIF($BC$12:$BC22,$BC22)=3,0,IF($BC22=BL$11,INDEX($AZ$12:$AZ$25,MATCH(BL$11,$AV$12:$AV$25,0)),0)),BL21)","v":0},{"$f":"IFERROR(IF(COUNTIF($BC$12:$BC22,$BC22)=3,0,IF($BC22=BM$11,INDEX($AZ$12:$AZ$25,MATCH(BM$11,$AV$12:$AV$25,0)),0)),BM21)","v":0}]
[null,null,null,null,null,null,null,null,null,null,null,null,null,null,null,null,null,null,null,null,null,null,null,null,null,null,null,null,null,null,null,null,null,null,null,null,null,null,null,null,null,null,null,null,null,null,null,null,null,null,null,null,null,null,{"$f":"IF(COUNTIF(BC$11:BC22,BC22)=3,OFFSET($AV$12,(ROW(BC23)-ROW(BC$12))/3,0),BC22)","v":""},0,0,{"$f":"IF(COUNTIF($BC$12:$BC23,$BC23)=3,0,IF($BC23=BF$11,INDEX($AZ$12:$AZ$25,MATCH(BF$11,$AV$12:$AV$25,0)),0))","v":0},{"$f":"IF(COUNTIF($BC$12:$BC23,$BC23)=3,0,IF($BC23=BG$11,INDEX($AZ$12:$AZ$25,MATCH(BG$11,$AV$12:$AV$25,0)),0))","v":0},{"$f":"IF(COUNTIF($BC$12:$BC23,$BC23)=3,0,IF($BC23=BH$11,INDEX($AZ$12:$AZ$25,MATCH(BH$11,$AV$12:$AV$25,0)),0))","v":0},{"$f":"IF(COUNTIF($BC$12:$BC23,$BC23)=3,0,IF($BC23=BI$11,INDEX($AZ$12:$AZ$25,MATCH(BI$11,$AV$12:$AV$25,0)),0))","v":0},{"$f":"IFERROR(IF(COUNTIF($BC$12:$BC23,$BC23)=3,0,IF($BC23=BJ$11,INDEX($AZ$12:$AZ$25,MATCH(BJ$11,$AV$12:$AV$25,0)),0)),BJ22)","v":0},{"$f":"IFERROR(IF(COUNTIF($BC$12:$BC23,$BC23)=3,0,IF($BC23=BK$11,INDEX($AZ$12:$AZ$25,MATCH(BK$11,$AV$12:$AV$25,0)),0)),BK22)","v":0},{"$f":"IFERROR(IF(COUNTIF($BC$12:$BC23,$BC23)=3,0,IF($BC23=BL$11,INDEX($AZ$12:$AZ$25,MATCH(BL$11,$AV$12:$AV$25,0)),0)),BL22)","v":0},{"$f":"IFERROR(IF(COUNTIF($BC$12:$BC23,$BC23)=3,0,IF($BC23=BM$11,INDEX($AZ$12:$AZ$25,MATCH(BM$11,$AV$12:$AV$25,0)),0)),BM22)","v":0}]
[null,null,null,null,null,null,null,null,null,null,null,null,null,null,null,null,null,null,null,null,null,null,null,null,null,null,null,null,null,null,null,null,null,null,null,null,null,null,null,null,null,null,null,null,null,null,null,null,null,null,null,null,null,null,{"$f":"IFERROR(IF(COUNTIF(BC$11:BC23,BC23)=3,OFFSET($AV$12,(ROW(BC24)-ROW(BC$12))/3,0),BC23),\"\")","v":""},0,0,{"$f":"IFERROR(IF(COUNTIF($BC$12:$BC24,$BC24)=3,0,IF($BC24=BF$11,INDEX($AZ$12:$AZ$25,MATCH(BF$11,$AV$12:$AV$25,0)),0)),BF23)","v":0},{"$f":"IFERROR(IF(COUNTIF($BC$12:$BC24,$BC24)=3,0,IF($BC24=BG$11,INDEX($AZ$12:$AZ$25,MATCH(BG$11,$AV$12:$AV$25,0)),0)),BG23)","v":0},{"$f":"IFERROR(IF(COUNTIF($BC$12:$BC24,$BC24)=3,0,IF($BC24=BH$11,INDEX($AZ$12:$AZ$25,MATCH(BH$11,$AV$12:$AV$25,0)),0)),BH23)","v":0},{"$f":"IFERROR(IF(COUNTIF($BC$12:$BC24,$BC24)=3,0,IF($BC24=BI$11,INDEX($AZ$12:$AZ$25,MATCH(BI$11,$AV$12:$AV$25,0)),0)),BI23)","v":0},{"$f":"IFERROR(IF(COUNTIF($BC$12:$BC24,$BC24)=3,0,IF($BC24=BJ$11,INDEX($AZ$12:$AZ$25,MATCH(BJ$11,$AV$12:$AV$25,0)),0)),BJ23)","v":0},{"$f":"IFERROR(IF(COUNTIF($BC$12:$BC24,$BC24)=3,0,IF($BC24=BK$11,INDEX($AZ$12:$AZ$25,MATCH(BK$11,$AV$12:$AV$25,0)),0)),BK23)","v":0},{"$f":"IFERROR(IF(COUNTIF($BC$12:$BC24,$BC24)=3,0,IF($BC24=BL$11,INDEX($AZ$12:$AZ$25,MATCH(BL$11,$AV$12:$AV$25,0)),0)),BL23)","v":0},{"$f":"IFERROR(IF(COUNTIF($BC$12:$BC24,$BC24)=3,0,IF($BC24=BM$11,INDEX($AZ$12:$AZ$25,MATCH(BM$11,$AV$12:$AV$25,0)),0)),BM23)","v":0}]
[null,null,null,null,null,null,null,null,null,null,null,null,null,null,null,null,null,null,null,null,null,null,null,null,null,null,null,null,null,null,null,null,null,null,null,null,null,null,null,null,null,null,null,null,null,null,null,null,null,null,null,null,null,null,{"$f":"IFERROR(IF(COUNTIF(BC$11:BC24,BC24)=3,OFFSET($AV$12,(ROW(BC25)-ROW(BC$12))/3,0),BC24),\"\")","v":""},{"$f":"IFERROR(INDEX($BA$12:$BA$25,MATCH(BC24,$AV$12:$AV$25,0)),BD24)","v":0},0,{"$f":"IFERROR(IF(COUNTIF($BC$12:$BC25,$BC25)=3,0,IF($BC25=BF$11,INDEX($AZ$12:$AZ$25,MATCH(BF$11,$AV$12:$AV$25,0)),0)),BF24)","v":0},{"$f":"IFERROR(IF(COUNTIF($BC$12:$BC25,$BC25)=3,0,IF($BC25=BG$11,INDEX($AZ$12:$AZ$25,MATCH(BG$11,$AV$12:$AV$25,0)),0)),BG24)","v":0},{"$f":"IFERROR(IF(COUNTIF($BC$12:$BC25,$BC25)=3,0,IF($BC25=BH$11,INDEX($AZ$12:$AZ$25,MATCH(BH$11,$AV$12:$AV$25,0)),0)),BH24)","v":0},{"$f":"IFERROR(IF(COUNTIF($BC$12:$BC25,$BC25)=3,0,IF($BC25=BI$11,INDEX($AZ$12:$AZ$25,MATCH(BI$11,$AV$12:$AV$25,0)),0)),BI24)","v":0},{"$f":"IFERROR(IF(COUNTIF($BC$12:$BC25,$BC25)=3,0,IF($BC25=BJ$11,INDEX($AZ$12:$AZ$25,MATCH(BJ$11,$AV$12:$AV$25,0)),0)),BJ24)","v":0},{"$f":"IFERROR(IF(COUNTIF($BC$12:$BC25,$BC25)=3,0,IF($BC25=BK$11,INDEX($AZ$12:$AZ$25,MATCH(BK$11,$AV$12:$AV$25,0)),0)),BK24)","v":0},{"$f":"IFERROR(IF(COUNTIF($BC$12:$BC25,$BC25)=3,0,IF($BC25=BL$11,INDEX($AZ$12:$AZ$25,MATCH(BL$11,$AV$12:$AV$25,0)),0)),BL24)","v":0},{"$f":"IFERROR(IF(COUNTIF($BC$12:$BC25,$BC25)=3,0,IF($BC25=BM$11,INDEX($AZ$12:$AZ$25,MATCH(BM$11,$AV$12:$AV$25,0)),0)),BM24)","v":0}]
[null,null,null,null,null,null,null,null,null,null,null,null,null,null,null,null,null,null,null,null,null,null,null,null,null,null,null,null,null,null,null,null,null,null,null,null,null,null,null,null,null,null,null,null,null,null,null,null,null,null,null,null,null,null,{"$f":"IFERROR(IF(COUNTIF(BC$11:BC25,BC25)=3,OFFSET($AV$12,(ROW(BC26)-ROW(BC$12))/3,0),BC25),\"\")","v":""},{"$f":"IFERROR(INDEX($BA$12:$BA$25,MATCH(BC25,$AV$12:$AV$25,0)),BD25)","v":0},0,{"$f":"IFERROR(IF(COUNTIF($BC$12:$BC26,$BC26)=3,0,IF($BC26=BF$11,INDEX($AZ$12:$AZ$25,MATCH(BF$11,$AV$12:$AV$25,0)),0)),BF25)","v":0},{"$f":"IFERROR(IF(COUNTIF($BC$12:$BC26,$BC26)=3,0,IF($BC26=BG$11,INDEX($AZ$12:$AZ$25,MATCH(BG$11,$AV$12:$AV$25,0)),0)),BG25)","v":0},{"$f":"IFERROR(IF(COUNTIF($BC$12:$BC26,$BC26)=3,0,IF($BC26=BH$11,INDEX($AZ$12:$AZ$25,MATCH(BH$11,$AV$12:$AV$25,0)),0)),BH25)","v":0},{"$f":"IFERROR(IF(COUNTIF($BC$12:$BC26,$BC26)=3,0,IF($BC26=BI$11,INDEX($AZ$12:$AZ$25,MATCH(BI$11,$AV$12:$AV$25,0)),0)),BI25)","v":0},{"$f":"IFERROR(IF(COUNTIF($BC$12:$BC26,$BC26)=3,0,IF($BC26=BJ$11,INDEX($AZ$12:$AZ$25,MATCH(BJ$11,$AV$12:$AV$25,0)),0)),BJ25)","v":0},{"$f":"IFERROR(IF(COUNTIF($BC$12:$BC26,$BC26)=3,0,IF($BC26=BK$11,INDEX($AZ$12:$AZ$25,MATCH(BK$11,$AV$12:$AV$25,0)),0)),BK25)","v":0},{"$f":"IFERROR(IF(COUNTIF($BC$12:$BC26,$BC26)=3,0,IF($BC26=BL$11,INDEX($AZ$12:$AZ$25,MATCH(BL$11,$AV$12:$AV$25,0)),0)),BL25)","v":0},{"$f":"IFERROR(IF(COUNTIF($BC$12:$BC26,$BC26)=3,0,IF($BC26=BM$11,INDEX($AZ$12:$AZ$25,MATCH(BM$11,$AV$12:$AV$25,0)),0)),BM25)","v":0}]
[null,null,null,null,null,null,null,null,null,null,null,null,null,null,null,null,null,null,null,null,null,null,null,null,null,null,null,null,null,null,null,null,null,null,null,null,null,null,null,null,null,null,null,null,null,null,null,null,null,null,null,null,null,null,{"$f":"IFERROR(IF(COUNTIF(BC$11:BC26,BC26)=3,OFFSET($AV$12,(ROW(BC27)-ROW(BC$12))/3,0),BC26),\"\")","v":""},0,0,{"$f":"IFERROR(IF(COUNTIF($BC$12:$BC27,$BC27)=3,0,IF($BC27=BF$11,INDEX($AZ$12:$AZ$25,MATCH(BF$11,$AV$12:$AV$25,0)),0)),BF26)","v":0},{"$f":"IFERROR(IF(COUNTIF($BC$12:$BC27,$BC27)=3,0,IF($BC27=BG$11,INDEX($AZ$12:$AZ$25,MATCH(BG$11,$AV$12:$AV$25,0)),0)),BG26)","v":0},{"$f":"IFERROR(IF(COUNTIF($BC$12:$BC27,$BC27)=3,0,IF($BC27=BH$11,INDEX($AZ$12:$AZ$25,MATCH(BH$11,$AV$12:$AV$25,0)),0)),BH26)","v":0},{"$f":"IFERROR(IF(COUNTIF($BC$12:$BC27,$BC27)=3,0,IF($BC27=BI$11,INDEX($AZ$12:$AZ$25,MATCH(BI$11,$AV$12:$AV$25,0)),0)),BI26)","v":0},{"$f":"IFERROR(IF(COUNTIF($BC$12:$BC27,$BC27)=3,0,IF($BC27=BJ$11,INDEX($AZ$12:$AZ$25,MATCH(BJ$11,$AV$12:$AV$25,0)),0)),BJ26)","v":0},{"$f":"IFERROR(IF(COUNTIF($BC$12:$BC27,$BC27)=3,0,IF($BC27=BK$11,INDEX($AZ$12:$AZ$25,MATCH(BK$11,$AV$12:$AV$25,0)),0)),BK26)","v":0},{"$f":"IFERROR(IF(COUNTIF($BC$12:$BC27,$BC27)=3,0,IF($BC27=BL$11,INDEX($AZ$12:$AZ$25,MATCH(BL$11,$AV$12:$AV$25,0)),0)),BL26)","v":0},{"$f":"IFERROR(IF(COUNTIF($BC$12:$BC27,$BC27)=3,0,IF($BC27=BM$11,INDEX($AZ$12:$AZ$25,MATCH(BM$11,$AV$12:$AV$25,0)),0)),BM26)","v":0}]
[null,null,null,null,null,null,null,null,null,null,null,null,null,null,null,null,null,null,null,null,null,null,null,null,null,null,null,null,null,null,null,null,null,null,null,null,null,null,null,null,null,null,null,null,null,null,null,null,null,null,null,null,null,null,{"$f":"IFERROR(IF(COUNTIF(BC$11:BC27,BC27)=3,OFFSET($AV$12,(ROW(BC28)-ROW(BC$12))/3,0),BC27),\"\")","v":""},0,0,{"$f":"IFERROR(IF(COUNTIF($BC$12:$BC28,$BC28)=3,0,IF($BC28=BF$11,INDEX($AZ$12:$AZ$25,MATCH(BF$11,$AV$12:$AV$25,0)),0)),BF27)","v":0},{"$f":"IFERROR(IF(COUNTIF($BC$12:$BC28,$BC28)=3,0,IF($BC28=BG$11,INDEX($AZ$12:$AZ$25,MATCH(BG$11,$AV$12:$AV$25,0)),0)),BG27)","v":0},{"$f":"IFERROR(IF(COUNTIF($BC$12:$BC28,$BC28)=3,0,IF($BC28=BH$11,INDEX($AZ$12:$AZ$25,MATCH(BH$11,$AV$12:$AV$25,0)),0)),BH27)","v":0},{"$f":"IFERROR(IF(COUNTIF($BC$12:$BC28,$BC28)=3,0,IF($BC28=BI$11,INDEX($AZ$12:$AZ$25,MATCH(BI$11,$AV$12:$AV$25,0)),0)),BI27)","v":0},{"$f":"IFERROR(IF(COUNTIF($BC$12:$BC28,$BC28)=3,0,IF($BC28=BJ$11,INDEX($AZ$12:$AZ$25,MATCH(BJ$11,$AV$12:$AV$25,0)),0)),BJ27)","v":0},{"$f":"IFERROR(IF(COUNTIF($BC$12:$BC28,$BC28)=3,0,IF($BC28=BK$11,INDEX($AZ$12:$AZ$25,MATCH(BK$11,$AV$12:$AV$25,0)),0)),BK27)","v":0},{"$f":"IFERROR(IF(COUNTIF($BC$12:$BC28,$BC28)=3,0,IF($BC28=BL$11,INDEX($AZ$12:$AZ$25,MATCH(BL$11,$AV$12:$AV$25,0)),0)),BL27)","v":0},{"$f":"IFERROR(IF(COUNTIF($BC$12:$BC28,$BC28)=3,0,IF($BC28=BM$11,INDEX($AZ$12:$AZ$25,MATCH(BM$11,$AV$12:$AV$25,0)),0)),BM27)","v":0}]
[null,null,null,null,null,null,null,null,null,null,null,null,null,null,null,null,null,null,null,null,null,null,null,null,null,null,null,null,null,null,null,null,null,null,null,null,null,null,null,null,null,null,null,null,null,null,null,null,null,null,null,null,null,null,{"$f":"IFERROR(IF(COUNTIF(BC$11:BC28,BC28)=3,OFFSET($AV$12,(ROW(BC29)-ROW(BC$12))/3,0),BC28),\"\")","v":""},0,0,{"$f":"IFERROR(IF(COUNTIF($BC$12:$BC29,$BC29)=3,0,IF($BC29=BF$11,INDEX($AZ$12:$AZ$25,MATCH(BF$11,$AV$12:$AV$25,0)),0)),BF28)","v":0},{"$f":"IFERROR(IF(COUNTIF($BC$12:$BC29,$BC29)=3,0,IF($BC29=BG$11,INDEX($AZ$12:$AZ$25,MATCH(BG$11,$AV$12:$AV$25,0)),0)),BG28)","v":0},{"$f":"IFERROR(IF(COUNTIF($BC$12:$BC29,$BC29)=3,0,IF($BC29=BH$11,INDEX($AZ$12:$AZ$25,MATCH(BH$11,$AV$12:$AV$25,0)),0)),BH28)","v":0},{"$f":"IFERROR(IF(COUNTIF($BC$12:$BC29,$BC29)=3,0,IF($BC29=BI$11,INDEX($AZ$12:$AZ$25,MATCH(BI$11,$AV$12:$AV$25,0)),0)),BI28)","v":0},{"$f":"IFERROR(IF(COUNTIF($BC$12:$BC29,$BC29)=3,0,IF($BC29=BJ$11,INDEX($AZ$12:$AZ$25,MATCH(BJ$11,$AV$12:$AV$25,0)),0)),BJ28)","v":0},{"$f":"IFERROR(IF(COUNTIF($BC$12:$BC29,$BC29)=3,0,IF($BC29=BK$11,INDEX($AZ$12:$AZ$25,MATCH(BK$11,$AV$12:$AV$25,0)),0)),BK28)","v":0},{"$f":"IFERROR(IF(COUNTIF($BC$12:$BC29,$BC29)=3,0,IF($BC29=BL$11,INDEX($AZ$12:$AZ$25,MATCH(BL$11,$AV$12:$AV$25,0)),0)),BL28)","v":0},{"$f":"IFERROR(IF(COUNTIF($BC$12:$BC29,$BC29)=3,0,IF($BC29=BM$11,INDEX($AZ$12:$AZ$25,MATCH(BM$11,$AV$12:$AV$25,0)),0)),BM28)","v":0}]
[null,null,null,null,null,null,null,null,null,null,null,null,null,null,null,null,null,null,null,null,null,null,null,null,null,null,null,null,null,null,null,null,null,null,null,null,null,null,null,null,null,null,null,null,null,null,null,null,null,null,null,null,null,null,{"$f":"IFERROR(IF(COUNTIF(BC$11:BC29,BC29)=3,OFFSET($AV$12,(ROW(BC30)-ROW(BC$12))/3,0),BC29),\"\")","v":""},0,0,{"$f":"IFERROR(IF(COUNTIF($BC$12:$BC30,$BC30)=3,0,IF($BC30=BF$11,INDEX($AZ$12:$AZ$25,MATCH(BF$11,$AV$12:$AV$25,0)),0)),BF29)","v":0},{"$f":"IFERROR(IF(COUNTIF($BC$12:$BC30,$BC30)=3,0,IF($BC30=BG$11,INDEX($AZ$12:$AZ$25,MATCH(BG$11,$AV$12:$AV$25,0)),0)),BG29)","v":0},{"$f":"IFERROR(IF(COUNTIF($BC$12:$BC30,$BC30)=3,0,IF($BC30=BH$11,INDEX($AZ$12:$AZ$25,MATCH(BH$11,$AV$12:$AV$25,0)),0)),BH29)","v":0},{"$f":"IFERROR(IF(COUNTIF($BC$12:$BC30,$BC30)=3,0,IF($BC30=BI$11,INDEX($AZ$12:$AZ$25,MATCH(BI$11,$AV$12:$AV$25,0)),0)),BI29)","v":0},{"$f":"IFERROR(IF(COUNTIF($BC$12:$BC30,$BC30)=3,0,IF($BC30=BJ$11,INDEX($AZ$12:$AZ$25,MATCH(BJ$11,$AV$12:$AV$25,0)),0)),BJ29)","v":0},{"$f":"IFERROR(IF(COUNTIF($BC$12:$BC30,$BC30)=3,0,IF($BC30=BK$11,INDEX($AZ$12:$AZ$25,MATCH(BK$11,$AV$12:$AV$25,0)),0)),BK29)","v":0},{"$f":"IFERROR(IF(COUNTIF($BC$12:$BC30,$BC30)=3,0,IF($BC30=BL$11,INDEX($AZ$12:$AZ$25,MATCH(BL$11,$AV$12:$AV$25,0)),0)),BL29)","v":0},{"$f":"IFERROR(IF(COUNTIF($BC$12:$BC30,$BC30)=3,0,IF($BC30=BM$11,INDEX($AZ$12:$AZ$25,MATCH(BM$11,$AV$12:$AV$25,0)),0)),BM29)","v":0}]
[null,null,null,null,null,null,null,null,null,null,null,null,null,null,null,null,null,null,null,null,null,null,null,null,null,null,null,null,null,null,null,null,null,null,null,null,null,null,null,null,null,null,null,null,null,null,null,null,null,null,null,null,null,null,{"$f":"IFERROR(IF(COUNTIF(BC$11:BC30,BC30)=3,OFFSET($AV$12,(ROW(BC31)-ROW(BC$12))/3,0),BC30),\"\")","v":""},0,0,{"$f":"IFERROR(IF(COUNTIF($BC$12:$BC31,$BC31)=3,0,IF($BC31=BF$11,INDEX($AZ$12:$AZ$25,MATCH(BF$11,$AV$12:$AV$25,0)),0)),BF30)","v":0},{"$f":"IFERROR(IF(COUNTIF($BC$12:$BC31,$BC31)=3,0,IF($BC31=BG$11,INDEX($AZ$12:$AZ$25,MATCH(BG$11,$AV$12:$AV$25,0)),0)),BG30)","v":0},{"$f":"IFERROR(IF(COUNTIF($BC$12:$BC31,$BC31)=3,0,IF($BC31=BH$11,INDEX($AZ$12:$AZ$25,MATCH(BH$11,$AV$12:$AV$25,0)),0)),BH30)","v":0},{"$f":"IFERROR(IF(COUNTIF($BC$12:$BC31,$BC31)=3,0,IF($BC31=BI$11,INDEX($AZ$12:$AZ$25,MATCH(BI$11,$AV$12:$AV$25,0)),0)),BI30)","v":0},{"$f":"IFERROR(IF(COUNTIF($BC$12:$BC31,$BC31)=3,0,IF($BC31=BJ$11,INDEX($AZ$12:$AZ$25,MATCH(BJ$11,$AV$12:$AV$25,0)),0)),BJ30)","v":0},{"$f":"IFERROR(IF(COUNTIF($BC$12:$BC31,$BC31)=3,0,IF($BC31=BK$11,INDEX($AZ$12:$AZ$25,MATCH(BK$11,$AV$12:$AV$25,0)),0)),BK30)","v":0},{"$f":"IFERROR(IF(COUNTIF($BC$12:$BC31,$BC31)=3,0,IF($BC31=BL$11,INDEX($AZ$12:$AZ$25,MATCH(BL$11,$AV$12:$AV$25,0)),0)),BL30)","v":0},{"$f":"IFERROR(IF(COUNTIF($BC$12:$BC31,$BC31)=3,0,IF($BC31=BM$11,INDEX($AZ$12:$AZ$25,MATCH(BM$11,$AV$12:$AV$25,0)),0)),BM30)","v":0}]
[null,null,null,null,null,null,null,null,null,null,null,null,null,null,null,null,null,null,null,null,null,null,null,null,null,null,null,null,null,null,null,null,null,null,null,null,null,null,null,null,null,null,null,null,null,null,null,null,null,null,null,null,null,null,{"$f":"IFERROR(IF(COUNTIF(BC$11:BC31,BC31)=3,OFFSET($AV$12,(ROW(BC32)-ROW(BC$12))/3,0),BC31),\"\")","v":""},0,0,{"$f":"IFERROR(IF(COUNTIF($BC$12:$BC32,$BC32)=3,0,IF($BC32=BF$11,INDEX($AZ$12:$AZ$25,MATCH(BF$11,$AV$12:$AV$25,0)),0)),BF31)","v":0},{"$f":"IFERROR(IF(COUNTIF($BC$12:$BC32,$BC32)=3,0,IF($BC32=BG$11,INDEX($AZ$12:$AZ$25,MATCH(BG$11,$AV$12:$AV$25,0)),0)),BG31)","v":0},{"$f":"IFERROR(IF(COUNTIF($BC$12:$BC32,$BC32)=3,0,IF($BC32=BH$11,INDEX($AZ$12:$AZ$25,MATCH(BH$11,$AV$12:$AV$25,0)),0)),BH31)","v":0},{"$f":"IFERROR(IF(COUNTIF($BC$12:$BC32,$BC32)=3,0,IF($BC32=BI$11,INDEX($AZ$12:$AZ$25,MATCH(BI$11,$AV$12:$AV$25,0)),0)),BI31)","v":0},{"$f":"IFERROR(IF(COUNTIF($BC$12:$BC32,$BC32)=3,0,IF($BC32=BJ$11,INDEX($AZ$12:$AZ$25,MATCH(BJ$11,$AV$12:$AV$25,0)),0)),BJ31)","v":0},{"$f":"IFERROR(IF(COUNTIF($BC$12:$BC32,$BC32)=3,0,IF($BC32=BK$11,INDEX($AZ$12:$AZ$25,MATCH(BK$11,$AV$12:$AV$25,0)),0)),BK31)","v":0},{"$f":"IFERROR(IF(COUNTIF($BC$12:$BC32,$BC32)=3,0,IF($BC32=BL$11,INDEX($AZ$12:$AZ$25,MATCH(BL$11,$AV$12:$AV$25,0)),0)),BL31)","v":0},{"$f":"IFERROR(IF(COUNTIF($BC$12:$BC32,$BC32)=3,0,IF($BC32=BM$11,INDEX($AZ$12:$AZ$25,MATCH(BM$11,$AV$12:$AV$25,0)),0)),BM31)","v":0}]
[null,null,null,null,null,null,null,null,null,null,null,null,null,null,null,null,null,null,null,null,null,null,null,null,null,null,null,null,null,null,null,null,null,null,null,null,null,null,null,null,null,null,null,null,null,null,null,null,null,null,null,null,null,null,{"$f":"IFERROR(IF(COUNTIF(BC$11:BC32,BC32)=3,OFFSET($AV$12,(ROW(BC33)-ROW(BC$12))/3,0),BC32),\"\")","v":""},0,0,{"$f":"IFERROR(IF(COUNTIF($BC$12:$BC33,$BC33)=3,0,IF($BC33=BF$11,INDEX($AZ$12:$AZ$25,MATCH(BF$11,$AV$12:$AV$25,0)),0)),BF32)","v":0},{"$f":"IFERROR(IF(COUNTIF($BC$12:$BC33,$BC33)=3,0,IF($BC33=BG$11,INDEX($AZ$12:$AZ$25,MATCH(BG$11,$AV$12:$AV$25,0)),0)),BG32)","v":0},{"$f":"IFERROR(IF(COUNTIF($BC$12:$BC33,$BC33)=3,0,IF($BC33=BH$11,INDEX($AZ$12:$AZ$25,MATCH(BH$11,$AV$12:$AV$25,0)),0)),BH32)","v":0},{"$f":"IFERROR(IF(COUNTIF($BC$12:$BC33,$BC33)=3,0,IF($BC33=BI$11,INDEX($AZ$12:$AZ$25,MATCH(BI$11,$AV$12:$AV$25,0)),0)),BI32)","v":0},{"$f":"IFERROR(IF(COUNTIF($BC$12:$BC33,$BC33)=3,0,IF($BC33=BJ$11,INDEX($AZ$12:$AZ$25,MATCH(BJ$11,$AV$12:$AV$25,0)),0)),BJ32)","v":0},{"$f":"IFERROR(IF(COUNTIF($BC$12:$BC33,$BC33)=3,0,IF($BC33=BK$11,INDEX($AZ$12:$AZ$25,MATCH(BK$11,$AV$12:$AV$25,0)),0)),BK32)","v":0},{"$f":"IFERROR(IF(COUNTIF($BC$12:$BC33,$BC33)=3,0,IF($BC33=BL$11,INDEX($AZ$12:$AZ$25,MATCH(BL$11,$AV$12:$AV$25,0)),0)),BL32)","v":0},{"$f":"IFERROR(IF(COUNTIF($BC$12:$BC33,$BC33)=3,0,IF($BC33=BM$11,INDEX($AZ$12:$AZ$25,MATCH(BM$11,$AV$12:$AV$25,0)),0)),BM32)","v":0}]
[null,null,null,null,null,null,null,null,null,null,null,null,null,null,null,null,null,null,null,null,null,null,null,null,null,null,null,null,null,null,null,null,null,null,null,null,null,null,null,null,null,null,null,null,null,null,null,null,null,null,null,null,null,null,{"$f":"IFERROR(IF(COUNTIF(BC$11:BC33,BC33)=3,OFFSET($AV$12,(ROW(BC34)-ROW(BC$12))/3,0),BC33),\"\")","v":""},0,0,{"$f":"IFERROR(IF(COUNTIF($BC$12:$BC34,$BC34)=3,0,IF($BC34=BF$11,INDEX($AZ$12:$AZ$25,MATCH(BF$11,$AV$12:$AV$25,0)),0)),BF33)","v":0},{"$f":"IFERROR(IF(COUNTIF($BC$12:$BC34,$BC34)=3,0,IF($BC34=BG$11,INDEX($AZ$12:$AZ$25,MATCH(BG$11,$AV$12:$AV$25,0)),0)),BG33)","v":0},{"$f":"IFERROR(IF(COUNTIF($BC$12:$BC34,$BC34)=3,0,IF($BC34=BH$11,INDEX($AZ$12:$AZ$25,MATCH(BH$11,$AV$12:$AV$25,0)),0)),BH33)","v":0},{"$f":"IFERROR(IF(COUNTIF($BC$12:$BC34,$BC34)=3,0,IF($BC34=BI$11,INDEX($AZ$12:$AZ$25,MATCH(BI$11,$AV$12:$AV$25,0)),0)),BI33)","v":0},{"$f":"IFERROR(IF(COUNTIF($BC$12:$BC34,$BC34)=3,0,IF($BC34=BJ$11,INDEX($AZ$12:$AZ$25,MATCH(BJ$11,$AV$12:$AV$25,0)),0)),BJ33)","v":0},{"$f":"IFERROR(IF(COUNTIF($BC$12:$BC34,$BC34)=3,0,IF($BC34=BK$11,INDEX($AZ$12:$AZ$25,MATCH(BK$11,$AV$12:$AV$25,0)),0)),BK33)","v":0},{"$f":"IFERROR(IF(COUNTIF($BC$12:$BC34,$BC34)=3,0,IF($BC34=BL$11,INDEX($AZ$12:$AZ$25,MATCH(BL$11,$AV$12:$AV$25,0)),0)),BL33)","v":0},{"$f":"IFERROR(IF(COUNTIF($BC$12:$BC34,$BC34)=3,0,IF($BC34=BM$11,INDEX($AZ$12:$AZ$25,MATCH(BM$11,$AV$12:$AV$25,0)),0)),BM33)","v":0}]
[null,null,null,null,null,null,null,null,null,null,null,null,null,null,null,null,null,null,null,null,null,null,null,null,null,null,null,null,null,null,null,null,null,null,null,null,null,null,null,null,null,null,null,null,null,null,null,null,null,null,null,null,null,null,{"$f":"IFERROR(IF(COUNTIF(BC$11:BC34,BC34)=3,OFFSET($AV$12,(ROW(BC35)-ROW(BC$12))/3,0),BC34),\"\")","v":""},0,0,{"$f":"IFERROR(IF(COUNTIF($BC$12:$BC35,$BC35)=3,0,IF($BC35=BF$11,INDEX($AZ$12:$AZ$25,MATCH(BF$11,$AV$12:$AV$25,0)),0)),BF34)","v":0},{"$f":"IFERROR(IF(COUNTIF($BC$12:$BC35,$BC35)=3,0,IF($BC35=BG$11,INDEX($AZ$12:$AZ$25,MATCH(BG$11,$AV$12:$AV$25,0)),0)),BG34)","v":0},{"$f":"IFERROR(IF(COUNTIF($BC$12:$BC35,$BC35)=3,0,IF($BC35=BH$11,INDEX($AZ$12:$AZ$25,MATCH(BH$11,$AV$12:$AV$25,0)),0)),BH34)","v":0},{"$f":"IFERROR(IF(COUNTIF($BC$12:$BC35,$BC35)=3,0,IF($BC35=BI$11,INDEX($AZ$12:$AZ$25,MATCH(BI$11,$AV$12:$AV$25,0)),0)),BI34)","v":0},{"$f":"IFERROR(IF(COUNTIF($BC$12:$BC35,$BC35)=3,0,IF($BC35=BJ$11,INDEX($AZ$12:$AZ$25,MATCH(BJ$11,$AV$12:$AV$25,0)),0)),BJ34)","v":0},{"$f":"IFERROR(IF(COUNTIF($BC$12:$BC35,$BC35)=3,0,IF($BC35=BK$11,INDEX($AZ$12:$AZ$25,MATCH(BK$11,$AV$12:$AV$25,0)),0)),BK34)","v":0},{"$f":"IFERROR(IF(COUNTIF($BC$12:$BC35,$BC35)=3,0,IF($BC35=BL$11,INDEX($AZ$12:$AZ$25,MATCH(BL$11,$AV$12:$AV$25,0)),0)),BL34)","v":0},{"$f":"IFERROR(IF(COUNTIF($BC$12:$BC35,$BC35)=3,0,IF($BC35=BM$11,INDEX($AZ$12:$AZ$25,MATCH(BM$11,$AV$12:$AV$25,0)),0)),BM34)","v":0}]

{"sheet":"Risk_Factors","index":3,"n_rows":148,"n_cols":21,"rows_kept":148,"cut":false,"hidden":false,"merged":[[14,2,16,2],[34,2,35,2],[76,3,78,3],[70,3,71,3],[72,3,73,3],[47,3,48,3],[37,3,38,3],[40,3,41,3],[63,3,64,3],[65,3,67,3],[57,3,58,3],[51,3,53,3],[54,3,56,3],[49,3,50,3],[25,2,27,2],[40,2,41,2],[11,3,13,3],[14,3,16,3],[31,3,32,3],[34,3,35,3],[28,3,29,3],[19,3,21,3],[22,3,24,3],[25,3,27,3],[28,2,29,2],[17,3,18,3],[19,2,21,2],[17,2,18,2],[22,2,24,2],[37,2,38,2],[6,8,6,13],[6,14,6,19],[82,8,82,13],[63,2,64,2],[65,2,67,2],[70,2,71,2],[72,2,73,2],[76,2,78,2],[11,2,13,2],[47,2,48,2],[51,2,53,2],[54,2,56,2],[57,2,58,2],[49,2,50,2],[31,2,32,2]]}
[]
["Factors Affecting the Risk of Non Compliance and Complaints Related to Dust Emissions "]
[]
[null,null,"S:","Factor related to the source of emissions (i.e., affects the amount of fugitive dust emitted)."]
[null,null,"P:","Factor related to the path of emissions between the source and receptors (i.e., affects dispersion)"]
[null,null,"R:","Factors related to the impact of the dust on the receptors"]
[null,null,null,null,null,null,null,null,"Weights",null,null,null,null,null,"Risk Score"]
[null,null,null,"Factor","Possible Conditions","Description","Points","Points Normalized",{"$f":"D123","v":"Unpaved road / area"},{"$f":"D124","v":"Paved road / area"},{"$f":"D125","v":"Material stockpile"},{"$f":"D126","v":"Material transfer (drop operations)"},{"$f":"D127","v":"Material transport (conveying, trucks)"},{"$f":"D128","v":"Process"},{"$f":"I8","v":"Unpaved road / area"},{"$f":"J8","v":"Paved road / area"},"Material stockpile","Material transfer (drop operations)","Material transport (conveying, trucks)",{"$f":"N8","v":"Process"}]
[]
[null,"Steady Conditions",null,null,null,null,null,null,null,null,null,null,null,null,{"$f":"SUM(O12,O15,O18,O20,O23,O26,O29,O32,O35,O38,O41,O48,O50,O52,O55,O58,O64,O71,O73,O77)","v":0.54240988056250017},{"$f":"SUM(P12,P15,P18,P20,P23,P26,P29,P32,P35,P38,P41,P48,P50,P52,P55,P58,P64,P71,P73,P77)","v":0.37946547000175013},0.393279191275,0.33148955924942503,0.36873429418749992,0.61295390370625003]
[null,null,null,null,null,null,null,null,null,null,null,null,null,null,{"$f":"'Problem Hierarchy'!V70","v":0.16792312500000001},{"$f":"'Problem Hierarchy'!V45","v":5.0376937500000003E-2},{"$f":"'Problem Hierarchy'!V131","v":5.2242750000000004E-2},{"$f":"'Problem Hierarchy'!AA112","v":7.72446375E-4},{"$f":"'Problem Hierarchy'!V95","v":3.4206562500000003E-2},{"$f":"'Problem Hierarchy'!V150","v":0.30039581250000003}]
[null,null,"S","Frequency of process / activity that generate fugitive dust:","Continuous","More than once a hour (>= 10 min duration)",10,{"$f":"G12/MAX(G12:G14)","v":1},{"$f":"I85*I91*I92","v":0.06},{"$f":"J85*J91*J92","v":1.2E-2},4.8000000000000001E-2,1.7999999999999999E-2,6.0000000000000001E-3,1.4999999999999999E-2,{"$f":"'Problem Hierarchy'!AF92","v":4.2115119749999999E-2},{"$f":"'Problem Hierarchy'!AF65","v":1.4087557933312501E-2},{"$f":"'Problem Hierarchy'!AF142","v":8.8394732999999993E-3},{"$f":"'Problem Hierarchy'!AF127","v":4.6951305750000004E-3},{"$f":"'Problem Hierarchy'!AF108","v":1.2355410375000001E-2},{"$f":"'Problem Hierarchy'!AF158","v":0.1317536033625}]
[null,null,null,null,"Intermittent","From once a day to once a hour (>= 10 min duration)",5,{"$f":"G13/MAX(G12:G14)","v":0.5},null,null,null,null,null,null,{"$f":"'Problem Hierarchy'!AF91","v":2.1057559875E-2},{"$f":"'Problem Hierarchy'!AF66","v":5.7057926951250004E-3},{"$f":"'Problem Hierarchy'!AF143","v":4.4197366499999996E-3},{"$f":"'Problem Hierarchy'!AF128","v":2.3475652875000002E-3},{"$f":"'Problem Hierarchy'!AF109","v":6.1777051875000003E-3},{"$f":"'Problem Hierarchy'!AF159","v":6.587680168125E-2}]
[null,null,null,null,"Sporadic","Less than once a day (>= 10 min duration)",1,{"$f":"G14/MAX(G12:G14)","v":0.1},null,null,null,null,null,null,{"$f":"'Problem Hierarchy'!AF90","v":7.0191866249999998E-3},{"$f":"'Problem Hierarchy'!AF67","v":2.3221249340625002E-3},{"$f":"'Problem Hierarchy'!AF144","v":1.4732455500000002E-3},{"$f":"'Problem Hierarchy'!AF129","v":7.825217625000001E-4},{"$f":"'Problem Hierarchy'!AF110","v":2.0592350625000004E-3},{"$f":"'Problem Hierarchy'!AF160","v":2.1958933893750004E-2}]
[null,null,"P","Position of the source related to sensible areas (e.g.: communities, working areas):","Close","< 200 m",10,{"$f":"G15/MAX(G15:G17)","v":1},{"$f":"I86*I109","v":0.09},0.09,0.09,0.09,0.09,0.09,{"$f":"'Problem Hierarchy'!AF25","v":5.6068080250000006E-2},{"$f":"$O15","v":5.6068080250000006E-2},{"$f":"$O15","v":5.6068080250000006E-2},5.6068080250000006E-2,5.6068080250000006E-2,5.6068080250000006E-2]
[null,null,null,null,"Medium ","200 m to 2 km",5,{"$f":"G16/MAX(G15:G17)","v":0.5},null,null,null,null,null,null,{"$f":"'Problem Hierarchy'!AF26","v":1.4639579500000001E-2},{"$f":"$O16","v":1.4639579500000001E-2},1.4639579500000001E-2,1.4639579500000001E-2,1.4639579500000001E-2,1.4639579500000001E-2]
[null,null,null,null,"Far ","> 2 km",1,{"$f":"G17/MAX(G15:G17)","v":0.1},null,null,null,null,null,null,{"$f":"'Problem Hierarchy'!AF27","v":4.7540902500000006E-3},4.7540902500000006E-3,4.7540902500000006E-3,4.7540902500000006E-3,4.7540902500000006E-3,4.7540902500000006E-3]
[null,null,"P","Predominant wind direction is from the source to the closest sensible area?","Yes",null,1,{"$f":"G18/MAX(G18:G19)","v":1},{"$f":"I86*I110","v":0.03},0.03,0.03,0.03,0.03,0.03,{"$f":"'Problem Hierarchy'!AF36","v":7.2206943750000002E-2},7.2206943750000002E-2,7.2206943750000002E-2,7.2206943750000002E-2,7.2206943750000002E-2,7.2206943750000002E-2]
[null,null,null,null,"No",null,0,{"$f":"G19/MAX(G18:G19)","v":0},null,null,null,null,null,null,{"$f":"'Problem Hierarchy'!AF37","v":8.0229937499999987E-3},8.0229937499999987E-3,8.0229937499999987E-3,8.0229937499999987E-3,8.0229937499999987E-3,8.0229937499999987E-3]
[null,null,"S","Relative amount of dust generated in the process / activity:","High ","Clearly visible, reaching areas outside the source.",10,0.63700000000000001,{"$f":"I85*I91*I93","v":0.03},{"$f":"J85*J91*J93","v":6.0000000000000001E-3},1.2E-2,6.0000000000000001E-3,3.0000000000000001E-3,0,{"$f":"$H20*O$11*$U$20","v":2.1393406125E-2},{"$f":"$H20*P$11*$U$20","v":6.4180218375000002E-3},6.655726350000001E-3,9.8409668175000015E-5,4.3579160625000007E-3,3.8270426512500011E-2,0.2]
[null,null,null,null,"Medium ","Visible, reaching areas outside the source.",5,0.25800000000000001,null,null,null,null,null,null,{"$f":"$H21*O$11*$U$20","v":8.6648332500000019E-3},2.5994499750000006E-3,2.6957259000000007E-3,3.9858232950000005E-5,1.7650586250000004E-3,1.5500423925000001E-2]
[null,null,null,null,"Low ","Almost not visible, limited to the source area.",1,0.105,null,null,null,null,null,null,3.5263856250000005E-3,1.0579156875000001E-3,1.0970977500000003E-3,1.6221373875E-5,7.183378125000001E-4,6.3083120625000008E-3]
[null,null,"R","Dust composition","Heavy metals","Presence of heavy metals",10,{"$f":"G23/MAX(G23:G25)","v":1},{"$f":"I87*I117","v":0.06},0.06,0.06,0.06,0.06,0.06,{"$f":"'Problem Hierarchy'!AF9","v":2.7475000000000003E-2},{"$f":"$O23","v":2.7475000000000003E-2},2.7475000000000003E-2,2.7475000000000003E-2,2.7475000000000003E-2,2.7475000000000003E-2]
[null,null,null,null,"Metals","Presence of metals",5,{"$f":"G24/MAX(G23:G25)","v":0.5},null,null,null,null,null,null,{"$f":"'Problem Hierarchy'!AF10","v":2.7475000000000003E-2},2.7475000000000003E-2,2.7475000000000003E-2,2.7475000000000003E-2,2.7475000000000003E-2,2.7475000000000003E-2]
[null,null,null,null,"No metals",null,1,{"$f":"G25/MAX(G23:G25)","v":0.1},null,null,null,null,null,null,{"$f":"'Problem Hierarchy'!AF11","v":2.3100000000000004E-3},2.3100000000000004E-3,2.3100000000000004E-3,2.3100000000000004E-3,2.3100000000000004E-3,2.3100000000000004E-3]
[null,null,"S, R","Dust size range (higher mass percentage)","Fine","< 30 µm (in case size distrubution is available)",10,{"$f":"G26/MAX(G26:G28)","v":1},{"$f":"I85*I91*I94+I86*I94","v":0.06},{"$f":"J85*J91*J94+J86*J94","v":3.5999999999999997E-2},0,0,3.3000000000000002E-2,0.16499999999999998,{"$f":"SUM('Problem Hierarchy'!AF13,'Problem Hierarchy'!AF21,'Problem Hierarchy'!AF86)","v":4.5982080687500003E-2},{"$f":"SUM('Problem Hierarchy'!AF13,'Problem Hierarchy'!AF21,'Problem Hierarchy'!AF61)","v":4.5059091230937501E-2},{"$f":"SUM('Problem Hierarchy'!AF13,'Problem Hierarchy'!AF21,'Problem Hierarchy'!AF138)","v":4.5136867625E-2},{"$f":"SUM('Problem Hierarchy'!AF13,'Problem Hierarchy'!AF21,'Problem Hierarchy'!AF119)","v":4.4637016456250005E-2},{"$f":"SUM('Problem Hierarchy'!AF13,'Problem Hierarchy'!AF21)","v":4.4588318750000001E-2},{"$f":"SUM('Problem Hierarchy'!AF13,'Problem Hierarchy'!AF21,'Problem Hierarchy'!AF150)","v":4.7021524831250001E-2}]
[null,null,null,null,"Medium","30 to 100 µm (in case size distrubution is available)",5,{"$f":"G27/MAX(G26:G28)","v":0.5},null,null,null,null,null,null,{"$f":"SUM('Problem Hierarchy'!AF14,'Problem Hierarchy'!AF22,'Problem Hierarchy'!AF87)","v":1.6017862062499999E-2},{"$f":"SUM('Problem Hierarchy'!AF14,'Problem Hierarchy'!AF22,'Problem Hierarchy'!AF62)","v":1.2993331488875E-2},{"$f":"SUM('Problem Hierarchy'!AF14,'Problem Hierarchy'!AF22,'Problem Hierarchy'!AF139)","v":1.3482222875E-2},{"$f":"SUM('Problem Hierarchy'!AF14,'Problem Hierarchy'!AF22,'Problem Hierarchy'!AF120)","v":1.1982669368749999E-2},{"$f":"SUM('Problem Hierarchy'!AF14,'Problem Hierarchy'!AF22)","v":1.183657625E-2},{"$f":"SUM('Problem Hierarchy'!AF14,'Problem Hierarchy'!AF22,'Problem Hierarchy'!AF151)","v":1.9136194493750001E-2}]
[null,null,null,null,"Coarse ","> 100 µm (in case size distrubution is available)",1,{"$f":"G28/MAX(G26:G28)","v":0.1},null,null,null,null,null,null,{"$f":"SUM('Problem Hierarchy'!AF15,'Problem Hierarchy'!AF23,'Problem Hierarchy'!AF88)","v":1.3376426625E-2},{"$f":"SUM('Problem Hierarchy'!AF15,'Problem Hierarchy'!AF23,'Problem Hierarchy'!AF63)","v":7.8698747176875004E-3},{"$f":"SUM('Problem Hierarchy'!AF15,'Problem Hierarchy'!AF23,'Problem Hierarchy'!AF140)","v":8.3051482499999999E-3},{"$f":"SUM('Problem Hierarchy'!AF15,'Problem Hierarchy'!AF23,'Problem Hierarchy'!AF121)","v":5.3060412374999998E-3},{"$f":"SUM('Problem Hierarchy'!AF15,'Problem Hierarchy'!AF23)","v":5.0138550000000002E-3},{"$f":"SUM('Problem Hierarchy'!AF15,'Problem Hierarchy'!AF23,'Problem Hierarchy'!AF152)","v":1.9613091487500001E-2}]
[null,null,"P","Is there some wind barrier (e.g.: trees, buldings, landscape) which can prevent the emissions from this source to reach the closest sensible area?","No",null,1,{"$f":"G29/MAX(G29:G30)","v":1},{"$f":"I86*I111","v":0.03},0.03,0.03,0.03,0.03,0.03,{"$f":"$H29*I29","v":0.03},{"$f":"$H29*J29","v":0.03},0.03,0.03,0.03,0.03]
[null,null,null,null,"Yes",null,0,{"$f":"G30/MAX(G29:G30)","v":0},null,null,null,null,null,null,{"$f":"$H30*I29","v":0},{"$f":"$H30*J29","v":0},0,0,0,0]
[]
[null,null,"S","Is there some measure applied on regular basis to prevent dust emission from this source?","No",null,1,{"$f":"G32/MAX(G32:G33)","v":1},{"$f":"I85*I91*I103","v":1.4999999999999999E-2},{"$f":"J85*J91*J103","v":3.0000000000000001E-3},6.0000000000000001E-3,3.0000000000000001E-3,1.5E-3,1.5E-3,{"$f":"$H32*O$11*$U32","v":1.67923125E-2},{"$f":"$H32*P$11*$U32","v":5.0376937500000007E-3},5.2242750000000004E-3,7.7244637500000008E-5,3.4206562500000005E-3,3.0039581250000003E-2,0.1]
[null,null,null,null,"Yes",null,0,{"$f":"G33/MAX(G32:G33)","v":0},null,null,null,null,null,null,{"$f":"$H33*I32","v":0},{"$f":"$H33*J32","v":0},0,0,0,0]
[]
[null,null,"S","Is there some measure applied to this source to reduce dust emission once it occur (reactive)?","No",null,1,{"$f":"G35/MAX(G35:G36)","v":1},{"$f":"I85*I91*I104","v":1.4999999999999999E-2},{"$f":"J85*J91*J104","v":3.0000000000000001E-3},6.0000000000000001E-3,3.0000000000000001E-3,1.5E-3,1.5E-3,{"$f":"$H35*O$11*$U35","v":1.67923125E-2},{"$f":"$H35*P$11*$U35","v":5.0376937500000007E-3},5.2242750000000004E-3,7.7244637500000008E-5,3.4206562500000005E-3,3.0039581250000003E-2,0.1]
[null,null,null,null,"Yes",null,0,{"$f":"G36/MAX(G35:G36)","v":0},null,null,null,null,null,null,{"$f":"H36/1000","v":0},{"$f":"O$35","v":1.67923125E-2},{"$f":"P$35","v":5.0376937500000007E-3},5.2242750000000004E-3,7.7244637500000008E-5,3.4206562500000005E-3]
[]
[null,null,"S","Is there some monitoring procedure applied to this source related to fugitive dust control?","No",null,1,{"$f":"G38/MAX(G38:G39)","v":1},{"$f":"I85*I91*I105","v":1.4999999999999999E-2},{"$f":"J85*J91*J105","v":3.0000000000000001E-3},6.0000000000000001E-3,3.0000000000000001E-3,1.5E-3,1.5E-3,{"$f":"$H38*O$11*$U38","v":1.67923125E-2},{"$f":"$H38*P$11*$U38","v":5.0376937500000007E-3},5.2242750000000004E-3,7.7244637500000008E-5,3.4206562500000005E-3,3.0039581250000003E-2,0.1]
[null,null,null,null,"Yes",null,0,{"$f":"G39/MAX(G38:G39)","v":0},null,null,null,null,null,null,{"$f":"$H39*I38","v":0},{"$f":"$H39*J38","v":0},0,0,0,0]
[]
[null,null,"S","Monitoring data / information trigger some control measure?","No",null,1,{"$f":"G41/MAX(G41:G42)","v":1},{"$f":"I85*I91*I106","v":1.4999999999999999E-2},{"$f":"J85*J91*J106","v":3.0000000000000001E-3},6.0000000000000001E-3,3.0000000000000001E-3,1.5E-3,1.5E-3,{"$f":"$H41*O$11*$U41","v":1.67923125E-2},{"$f":"$H41*P$11*$U41","v":5.0376937500000007E-3},5.2242750000000004E-3,7.7244637500000008E-5,3.4206562500000005E-3,3.0039581250000003E-2,0.1]
[null,null,null,null,"Yes",null,0,{"$f":"G42/MAX(G41:G42)","v":0},null,null,null,null,null,null,{"$f":"$H42*I41","v":0},{"$f":"$H42*J41","v":0},0,0,0,0]
[]
[]
[null,"Variable Conditions"]
[]
[null,null,"Weather Condition"]
[null,null,"S, P","Precipitation:","No",null,5,{"$f":"G48/MAX(G48:G49)","v":1},null,null,null,null,null,null,{"$f":"$H48*I48","v":0},{"$f":"$H48*J48","v":0},0,0,0,0]
[null,null,null,null,"Yes",null,1,{"$f":"G49/MAX(G48:G49)","v":0.2},null,null,null,null,null,null,{"$f":"$H49*I48","v":0},{"$f":"$H49*J48","v":0},0,0,0,0]
[null,null,"S","Humidity:","Dry",null,5,{"$f":"G50/MAX(G50:G51)","v":1},null,null,null,null,null,null,{"$f":"$H50*I50","v":0},{"$f":"$H50*J50","v":0},0,0,0,0]
[null,null,null,null,"Wet",null,1,{"$f":"G51/MAX(G50:G51)","v":0.2},null,null,null,null,null,null,{"$f":"$H51*I50","v":0},{"$f":"$H51*J50","v":0},0,0,0,0]
[null,null,"S","Temperature:","Hot ","> XX °C",4,{"$f":"G52/MAX(G52:G54)","v":1},null,null,null,null,null,null,{"$f":"$H52*I52","v":0},{"$f":"$H52*J52","v":0},0,0,0,0]
[null,null,null,null,"Moderate","YY to XX °C",2,{"$f":"G53/MAX(G52:G54)","v":0.5},null,null,null,null,null,null,{"$f":"$H53*I52","v":0},{"$f":"$H53*J52","v":0},0,0,0,0]
[null,null,null,null,"Cold"," <  YY °C",1,{"$f":"G54/MAX(G52:G54)","v":0.25},null,null,null,null,null,null,{"$f":"$H54*I52","v":0},{"$f":"$H54*J52","v":0},0,0,0,0]
[null,null,"S, P","Wind speed:","High","> XX m/s",4,{"$f":"G55/MAX(G55:G57)","v":1},{"$f":"I85*I91*I96-I86*I112","v":0},-2.4E-2,-5.9999999999999984E-3,-2.4E-2,-2.7E-2,-0.03,{"$f":"$H55*I55","v":0},{"$f":"$H55*J55","v":-2.4E-2},-5.9999999999999984E-3,-2.4E-2,-2.7E-2,-0.03]
[null,null,null,null,"Moderate","YY to XX m/s",2,{"$f":"G56/MAX(G55:G57)","v":0.5},null,null,null,null,null,null,{"$f":"$H56*I55","v":0},{"$f":"$H56*J55","v":-1.2E-2},-2.9999999999999992E-3,-1.2E-2,-1.35E-2,-1.4999999999999999E-2]
[null,null,null,null,"Low","<  YY m/s",1,{"$f":"G57/MAX(G55:G57)","v":0.25},null,null,null,null,null,null,{"$f":"$H57*I55","v":0},{"$f":"$H57*J55","v":-6.0000000000000001E-3},-1.4999999999999996E-3,-6.0000000000000001E-3,-6.7499999999999999E-3,-7.4999999999999997E-3]
[null,null,"P","Wind direction is to closest sensible area?","Yes",null,3,{"$f":"G58/MAX(G58:G59)","v":1},{"$f":"I86*I113","v":0.12},0.12,0.12,0.12,0.12,0.12,{"$f":"$H58*I58","v":0.12},{"$f":"$H58*J58","v":0.12},0.12,0.12,0.12,0.12]
[null,null,null,null,"No",null,1,{"$f":"G59/MAX(G58:G59)","v":0.33333333333333331},null,null,null,null,null,null,{"$f":"$H59*I58","v":3.9999999999999994E-2},{"$f":"$H59*J58","v":3.9999999999999994E-2},3.9999999999999994E-2,3.9999999999999994E-2,3.9999999999999994E-2,3.9999999999999994E-2]
[]
[]
[null,null,"Unpaved / Paved Road"]
[null,null,null,"Road conditions"]
[null,null,"S","Surface moisture","Dry",null,5,{"$f":"G64/MAX(G64:G65)","v":1},{"$f":"I85*I91*I97","v":0.03},6.0000000000000001E-3,1.2E-2,0,0,0,{"$f":"$H64*I64","v":0.03},{"$f":"$H64*J64","v":6.0000000000000001E-3},1.2E-2,0,0,0]
[null,null,null,null,"Wet",null,1,{"$f":"G65/MAX(G64:G65)","v":0.2},null,null,null,null,null,null,{"$f":"$H65*I64","v":6.0000000000000001E-3},{"$f":"$H65*J64","v":1.2000000000000001E-3},2.4000000000000002E-3,0,0,0]
[null,null,"S","Dust accumulated","High",null,10,{"$f":"G66/MAX(G66:G68)","v":1},{"$f":"I85*I91*I98","v":0.03},6.0000000000000001E-3,0,0,0,0,{"$f":"$H66*I66","v":0.03},{"$f":"$H66*J66","v":6.0000000000000001E-3},0,0,0,0]
[null,null,null,null,"Moderate",null,5,{"$f":"G67/MAX(G66:G68)","v":0.5},null,null,null,null,null,null,{"$f":"$H67*I66","v":1.4999999999999999E-2},{"$f":"$H67*J66","v":3.0000000000000001E-3},0,0,0,0]
[null,null,null,null,"Low",null,1,{"$f":"G68/MAX(G66:G68)","v":0.1},null,null,null,null,null,null,{"$f":"$H68*I66","v":3.0000000000000001E-3},{"$f":"$H68*J66","v":6.0000000000000006E-4},0,0,0,0]
[]
[null,null,null,"Vehicles"]
[null,null,"S","Speed","High","Exceeds speed limits at the site.",5,{"$f":"G71/MAX(G71:G72)","v":1},{"$f":"I85*I91*I99","v":0.03},6.0000000000000001E-3,0,0,8.9999999999999993E-3,0,{"$f":"$H71*I71","v":0.03},{"$f":"$H71*J71","v":6.0000000000000001E-3},0,0,8.9999999999999993E-3,0]
[null,null,null,null,"Low","Meet speed limits at the site",1,{"$f":"G72/MAX(G71:G72)","v":0.2},null,null,null,null,null,null,{"$f":"$H72*I71","v":6.0000000000000001E-3},{"$f":"$H72*J71","v":1.2000000000000001E-3},0,0,1.8E-3,0]
[null,null,"S","Granular material exceeding bucket height","Yes",null,5,{"$f":"G73/MAX(G73:G74)","v":1},{"$f":"I85*I91*I101","v":0},0,0,0,6.0000000000000001E-3,0,{"$f":"$H73*I73","v":0},{"$f":"$H73*J73","v":0},0,0,6.0000000000000001E-3,0]
[null,null,null,null,"No",null,1,{"$f":"G74/MAX(G73:G74)","v":0.2},null,null,null,null,null,null,{"$f":"$H74*I73","v":0},{"$f":"$H74*J73","v":0},0,0,1.2000000000000001E-3,0]
[]
[null,null,null,"Visible Emissions"]
[null,null,"S","Visible emissions","High",null,5,{"$f":"G77/MAX(G77:G79)","v":1},null,null,null,null,null,null,{"$f":"$H77*I77","v":0},{"$f":"$H77*J77","v":0},0,0,0,0]
[null,null,null,null,"Moderate",null,2,{"$f":"G78/MAX(G77:G79)","v":0.4},null,null,null,null,null,null,{"$f":"$H78*I77","v":0},{"$f":"$H78*J77","v":0},0,0,0,0]
[null,null,null,null,"Low",null,1,{"$f":"G79/MAX(G77:G79)","v":0.2},null,null,null,null,null,null,{"$f":"$H79*I77","v":0},{"$f":"$H79*J77","v":0},0,0,0,0]
[]
[]
[]
[null,null,null,null,null,null,null,null,"Relative Importance"]
[null,null,null,"Risk Factors",null,null,null,null,{"$f":"I8","v":"Unpaved road / area"},{"$f":"J8","v":"Paved road / area"},"Material stockpile","Material transfer (drop operations)","Material transport (conveying, trucks)","Process"]
[null,null,null,"Source",null,null,null,null,0.6,0.6,0.6,0.6,0.6,0.6]
[null,null,null,"Path",null,null,null,null,0.3,0.3,0.3,0.3,0.3,0.3]
[null,null,null,"Receptor",null,null,null,null,0.1,0.1,0.1,0.1,0.1,0.1]
[null,null,null,"Total",null,null,null,null,{"$f":"SUM(I85:I87)","v":0.99999999999999989},{"$f":"SUM(J85:J87)","v":0.99999999999999989},0.99999999999999989,0.99999999999999989,0.99999999999999989,0.99999999999999989]
[]
[null,null,null,"Source Factors"]
[null,null,null,"Relative amount of dust generated compared to other source categories at the Site:",null,null,null,null,0.5,0.1,0.2,0.1,0.05,0.05,{"$f":"SUM(I91:N91)","v":1}]
[null,null,null,{"$f":"D12","v":"Frequency of process / activity that generate fugitive dust:"},null,null,null,null,0.2,0.2,0.4,0.3,0.2,0.5]
[null,null,null,{"$f":"D20","v":"Relative amount of dust generated in the process / activity:"},null,null,null,null,0.1,0.1,0.1,0.1,0.1]
[null,null,null,{"$f":"D26","v":"Dust size range (higher mass percentage)"},null,null,null,null,0.1,0.1,null,null,0.1,0.5]
[null,null,null,"Total surface area",null,null,null,null,0.2,0.2,0.2]
[null,null,null,{"$f":"D55","v":"Wind speed:"},null,null,null,null,0.1,0.1,0.2,0.1,0.1]
[null,null,null,{"$f":"D64","v":"Surface moisture"},null,null,null,null,0.1,0.1,0.1]
[null,null,null,{"$f":"D66","v":"Dust accumulated"},null,null,null,null,0.1,0.1]
[null,null,null,{"$f":"D71","v":"Speed"},null,null,null,null,0.1,0.1,null,null,0.3]
[null,null,null,"Drop height",null,null,null,null,null,null,null,0.5]
[null,null,null,{"$f":"D73","v":"Granular material exceeding bucket height"},null,null,null,null,null,null,null,null,0.2]
[null,null,null,"Total",null,null,null,null,{"$f":"SUM(I92:I101)","v":1},1,0.99999999999999989,1,1,1]
[null,null,null,{"$f":"D32","v":"Is there some measure applied on regular basis to prevent dust emission from this source?"},null,null,null,null,0.05,0.05,0.05,0.05,0.05,0.05]
[null,null,null,{"$f":"D35","v":"Is there some measure applied to this source to reduce dust emission once it occur (reactive)?"},null,null,null,null,0.05,0.05,0.05,0.05,0.05,0.05]
[null,null,null,{"$f":"D38","v":"Is there some monitoring procedure applied to this source related to fugitive dust control?"},null,null,null,null,0.05,0.05,0.05,0.05,0.05,0.05]
[null,null,null,{"$f":"D41","v":"Monitoring data / information trigger some control measure?"},null,null,null,null,0.05,0.05,0.05,0.05,0.05,0.05]
[]
[null,null,null,"Path Factors"]
[null,null,null,{"$f":"D15","v":"Position of the source related to sensible areas (e.g.: communities, working areas):"},null,null,null,null,0.3,0.3,0.3,0.3,0.3,0.3]
[null,null,null,{"$f":"D18","v":"Predominant wind direction is from the source to the closest sensible area?"},null,null,null,null,0.1,0.1,0.1,0.1,0.1,0.1]
[null,null,null,{"$f":"D29","v":"Is there some wind barrier (e.g.: trees, buldings, landscape) which can prevent the emissions from this source to reach the closest sensible area?"},null,null,null,null,0.1,0.1,0.1,0.1,0.1,0.1]
[null,null,null,{"$f":"D55","v":"Wind speed:"},null,null,null,null,0.1,0.1,0.1,0.1,0.1,0.1]
[null,null,null,{"$f":"D58","v":"Wind direction is to closest sensible area?"},null,null,null,null,0.4,0.4,0.4,0.4,0.4,0.4]
[null,null,null,"Total",null,null,null,null,{"$f":"SUM(I109:I113)","v":1},{"$f":"SUM(J109:J113)","v":1},1,1,1,1]
[]
[null,null,null,"Receptors"]
[null,null,null,{"$f":"D23","v":"Dust composition"},null,null,null,null,0.6,0.6,0.6,0.6,0.6,0.6]
[null,null,null,{"$f":"D26","v":"Dust size range (higher mass percentage)"},null,null,null,null,0.4,0.4,0.4,0.4,0.4,0.4]
[null,null,null,"Total",null,null,null,null,{"$f":"SUM(I117:I118)","v":1},{"$f":"SUM(J117:J118)","v":1},1,1,1,1]
[]
[]
[null,null,null,"Sources"]
[null,null,null,"Unpaved road / area"]
[null,null,null,"Paved road / area"]
[null,null,null,"Material stockpile"]
[null,null,null,"Material transfer (drop operations)"]
[null,null,null,"Material transport (conveying, trucks)"]
[null,null,null,"Process"]
[null,null,null,"Blasting"]
[null,null,null,"Top soil removal"]
[]
[]
[]
[]
[]
[]
[null,null,null,"Factors affecting fugitive dust emission"]
[null,null,null,"Wind speed"]
[null,null,null,"Wind direction"]
[null,null,null,"Material moisture"]
[null,null,null,"Soil moisture"]
[null,null,null,"Surface moisture"]
[null,null,null,"Material granulometry"]
[null,null,null,"Material density"]
[null,null,null,"Loading conditions (drop height)"]
[null,null,null,"Vehicle speed"]
[null,null,null,"Conveyor speed"]
[null,null,null,"Distribution of material in the truck bucket"]

{"sheet":"Problem Hierarchy","index":4,"n_rows":160,"n_cols":34,"rows_kept":160,"cut":false,"hidden":false,"merged":[]}
[null,"Dust Risk Hierarchy"]
[null,"Weights calculated according to the Analytic Hierarchy Process (Saaty, Thomas L., 2008)",null,null,null,null,null,null,null,null,null,null,null,null,null,null,null,null,null,null,null,null,null,null,null,null,null,null,null,null,null,null,null,0.02]
[null,"Level 1",null,null,"Level 2",null,null,null,"Level 3",null,null,null,null,null,"Level 4",null,null,null,null,"Level 5",null,null,null,null,"Level 6",null,null,null,null,"Alternatives"]
[null,null,null,null,null,{"$f":"SUM(F6:F998)","v":1},null,null,null,null,{"$f":"SUM(K6:K998)","v":1},null,null,null,null,null,null,null,null,null,null,null,null,null,null,null,null,null,null,null,null,null,null,{"$f":"SUM(AH6:AH998)","v":1.0222432076875005}]
[]
[1,"Minimize risks of non compliance and complaints",null,1.1000000000000001,"Minimize health effects",{"$f":"Weights!H30","v":0.25},null,"1.1.1","Receptor sensitivity (health)",{"$f":"Weights!J36","v":4.7E-2},{"$f":"F$6*J6","v":1.175E-2},null,null,null,null,null,null,null,null,null,null,null,null,null,null,null,null,null,null,"Sensitive",{"$f":"Weights!H50","v":0.83333333333333337},{"$f":"K6*AE6","v":9.7916666666666673E-3},null,{"$f":"AF6","v":9.7916666666666673E-3}]
[null,null,null,null,null,null,null,null,null,null,null,null,null,null,null,null,null,null,null,null,null,null,null,null,null,null,null,null,null,"Non Sensitive",{"$f":"Weights!H51","v":0.16666666666666663},{"$f":"K6*AE7","v":1.9583333333333328E-3},null,{"$f":"AF7","v":1.9583333333333328E-3}]
[]
[null,null,null,null,null,null,null,"1.1.2","Dust toxicity (composition)",{"$f":"Weights!J37","v":0.14000000000000001},{"$f":"F$6*J9","v":3.5000000000000003E-2},null,null,null,null,null,null,null,null,null,null,null,null,null,null,null,null,null,null,"Heavy metals",{"$f":"Weights!I56","v":0.78500000000000003},{"$f":"K$9*AE9","v":2.7475000000000003E-2},null,{"$f":"AF9","v":2.7475000000000003E-2}]
[null,null,null,null,null,null,null,null,null,null,null,null,null,null,null,null,null,null,null,null,null,null,null,null,null,null,null,null,null,"Metals",{"$f":"Weights!I57","v":0.78500000000000003},{"$f":"K$9*AE10","v":2.7475000000000003E-2},null,{"$f":"AF10","v":2.7475000000000003E-2}]
[null,null,null,null,null,null,null,null,null,null,null,null,null,null,null,null,null,null,null,null,null,null,null,null,null,null,null,null,null,"No metals",{"$f":"Weights!I58","v":6.6000000000000003E-2},{"$f":"K$9*AE11","v":2.3100000000000004E-3},null,{"$f":"AF11","v":2.3100000000000004E-3}]
[]
[null,null,null,null,null,null,null,"1.1.3","Dust particle size",{"$f":"Weights!J38","v":0.19600000000000001},{"$f":"F$6*J13","v":4.9000000000000002E-2},null,null,null,null,null,null,null,null,null,null,null,null,null,null,null,null,null,null,"Fine",{"$f":"Weights!I63","v":0.73099999999999998},{"$f":"K$13*AE13","v":3.5819000000000004E-2},null,{"$f":"AF13","v":3.5819000000000004E-2}]
[null,null,null,null,null,null,null,null,null,null,null,null,null,null,null,null,null,null,null,null,null,null,null,null,null,null,null,null,null,"Medium",{"$f":"Weights!I64","v":0.188},{"$f":"K$13*AE14","v":9.2119999999999997E-3},null,{"$f":"AF14","v":9.2119999999999997E-3}]
[null,null,null,null,null,null,null,null,null,null,null,null,null,null,null,null,null,null,null,null,null,null,null,null,null,null,null,null,null,"Coarse",{"$f":"Weights!I65","v":8.1000000000000003E-2},{"$f":"K$13*AE15","v":3.9690000000000003E-3},null,{"$f":"AF15","v":3.9690000000000003E-3}]
[null,null,null,null,null,null,null,"1.1.4","Quantity of dust at the receptor",{"$f":"Weights!J39","v":0.61699999999999999},{"$f":"F$6*J16","v":0.15425}]
[]
[null,null,null,1.2,"Minimize aesthetic effects",{"$f":"Weights!H31","v":0.75},null,"1.2.1","Receptor sensitivity (welfare)",{"$f":"Weights!H44","v":0.1},{"$f":"F18*J18","v":7.5000000000000011E-2},null,null,null,null,null,null,null,null,null,null,null,null,null,null,null,null,null,null,"Sensitive",{"$f":"Weights!H70","v":0.75},{"$f":"K18*AE18","v":5.6250000000000008E-2},null,{"$f":"AF18","v":5.6250000000000008E-2}]
[null,null,null,null,null,null,null,null,null,null,null,null,null,null,null,null,null,null,null,null,null,null,null,null,null,null,null,null,null,"Non Sensitive",{"$f":"Weights!H71","v":0.25},{"$f":"K18*AE19","v":1.8750000000000003E-2},null,{"$f":"AF19","v":1.8750000000000003E-2}]
[]
[null,null,null,null,null,null,null,"1.2.2","Quantity of dust at the receptor",{"$f":"Weights!H45","v":0.9},{"$f":"F18*J21","v":0.67500000000000004},{"$f":"SUM(K16,K21)","v":0.82925000000000004},null,"1.2.2.1","Dispersion",{"$f":"Weights!H75","v":0.25},{"$f":"L$21*P21","v":0.20731250000000001},null,"1.2.2.1.1","Dust particle size",{"$f":"Weights!M81","v":0.06},{"$f":"Q$21*U21","v":1.243875E-2},null,null,null,null,null,null,null,"Fine",{"$f":"Weights!I164","v":0.70499999999999996},{"$f":"V$21*AE21","v":8.7693187499999995E-3},null,{"$f":"AF21","v":8.7693187499999995E-3}]
[null,null,null,null,null,null,null,null,null,null,null,null,null,null,null,null,null,null,null,null,null,null,null,null,null,null,null,null,null,"Medium",{"$f":"Weights!I165","v":0.21099999999999999},{"$f":"V$21*AE22","v":2.6245762499999999E-3},null,{"$f":"AF22","v":2.6245762499999999E-3}]
[null,null,null,null,null,null,null,null,null,null,null,null,null,null,null,null,null,null,null,null,null,null,null,null,null,null,null,null,null,"Coarse",{"$f":"Weights!I166","v":8.4000000000000005E-2},{"$f":"V$21*AE23","v":1.0448550000000001E-3},null,{"$f":"AF23","v":1.0448550000000001E-3}]
[]
[null,null,null,null,null,null,null,null,null,null,null,null,null,null,null,null,null,null,"1.2.2.1.2","Distance source - receptor",{"$f":"Weights!M82","v":0.36399999999999999},{"$f":"Q$21*U25","v":7.5461750000000008E-2},null,null,null,null,null,null,null,"Close",{"$f":"Weights!I171","v":0.74299999999999999},{"$f":"V$25*AE25","v":5.6068080250000006E-2},null,{"$f":"AF25","v":5.6068080250000006E-2}]
[null,null,null,null,null,null,null,null,null,null,null,null,null,null,null,null,null,null,null,null,null,null,null,null,null,null,null,null,null,"Medium",{"$f":"Weights!I172","v":0.19400000000000001},{"$f":"V$25*AE26","v":1.4639579500000001E-2},null,{"$f":"AF26","v":1.4639579500000001E-2}]
[null,null,null,null,null,null,null,null,null,null,null,null,null,null,null,null,null,null,null,null,null,null,null,null,null,null,null,null,null,"Far",{"$f":"Weights!I173","v":6.3E-2},{"$f":"V$25*AE27","v":4.7540902500000006E-3},null,{"$f":"AF27","v":4.7540902500000006E-3}]
[]
[null,null,null,null,null,null,null,null,null,null,null,null,null,null,null,null,null,null,"1.2.2.1.3","Wind breaks",{"$f":"Weights!M83","v":6.4000000000000001E-2},1.3268E-2,null,null,null,null,null,null,null,"No",{"$f":"Weights!H178","v":0.9},{"$f":"V$29*AE29","v":1.1941200000000001E-2},null,{"$f":"AF29","v":1.1941200000000001E-2}]
[null,null,null,null,null,null,null,null,null,null,null,null,null,null,null,null,null,null,null,null,null,null,null,null,null,null,null,null,null,"Yes",{"$f":"Weights!H179","v":9.9999999999999978E-2},{"$f":"V$29*AE30","v":1.3267999999999997E-3},null,{"$f":"AF30","v":1.3267999999999997E-3}]
[]
[null,null,null,null,null,null,null,null,null,null,null,null,null,null,null,null,null,null,"1.2.2.1.4","Wind speed",{"$f":"Weights!M84","v":4.9000000000000002E-2},1.0158312500000001E-2,null,null,null,null,null,null,null,"Low",{"$f":"Weights!I184","v":0.63700000000000001},{"$f":"$V$32*AE32","v":6.4708450625000002E-3},null,{"$f":"AF32","v":6.4708450625000002E-3}]
[null,null,null,null,null,null,null,null,null,null,null,null,null,null,null,null,null,null,null,null,null,null,null,null,null,null,null,null,null,"Medium ",{"$f":"Weights!I185","v":0.25800000000000001},{"$f":"$V$32*AE33","v":2.6208446250000003E-3},null,{"$f":"AF33","v":2.6208446250000003E-3}]
[null,null,null,null,null,null,null,null,null,null,null,null,null,null,null,null,null,null,null,null,null,null,null,null,null,null,null,null,null,"High",{"$f":"Weights!I186","v":0.105},1.0666228124999999E-3,null,{"$f":"AF34","v":1.0666228124999999E-3}]
[]
[null,null,null,null,null,null,null,null,null,null,null,null,null,null,null,null,null,null,"1.2.2.1.5","Wind direction",{"$f":"Weights!M85","v":0.38700000000000001},8.0229937500000001E-2,null,null,null,null,null,null,null,"Yes",{"$f":"Weights!H191","v":0.9},{"$f":"$V$36*AE36","v":7.2206943750000002E-2},null,{"$f":"AF36","v":7.2206943750000002E-2}]
[null,null,null,null,null,null,null,null,null,null,null,null,null,null,null,null,null,null,null,null,null,null,null,null,null,null,null,null,null,"No",{"$f":"Weights!H192","v":9.9999999999999978E-2},{"$f":"$V$36*AE37","v":8.0229937499999987E-3},null,{"$f":"AF37","v":8.0229937499999987E-3}]
[]
[null,null,null,null,null,null,null,null,null,null,null,null,null,null,null,null,null,null,"1.2.2.1.6","Atmospheric stability",{"$f":"Weights!M86","v":4.2999999999999997E-2},8.9144375000000005E-3,null,null,null,null,null,null,null,"Stable",{"$f":"Weights!H197","v":0.83333333333333337},{"$f":"$V$39*AE39","v":7.4286979166666676E-3},null,{"$f":"AF39","v":7.4286979166666676E-3}]
[null,null,null,null,null,null,null,null,null,null,null,null,null,null,null,null,null,null,null,null,null,null,null,null,null,null,null,null,null,"Not stable",{"$f":"Weights!H198","v":0.16666666666666663},{"$f":"$V$39*AE40","v":1.4857395833333331E-3},null,{"$f":"AF40","v":1.4857395833333331E-3}]
[]
[null,null,null,null,null,null,null,null,null,null,null,null,null,null,null,null,null,null,"1.2.2.1.7","Precipitation",{"$f":"Weights!M87","v":3.3000000000000002E-2},6.841312500000001E-3,null,null,null,null,null,null,null,"No",{"$f":"Weights!H203","v":0.75},{"$f":"$V$42*AE42","v":5.1309843750000006E-3},null,{"$f":"AF42","v":5.1309843750000006E-3}]
[null,null,null,null,null,null,null,null,null,null,null,null,null,null,null,null,null,null,null,null,null,null,null,null,null,null,null,null,null,"Yes",{"$f":"Weights!H204","v":0.25},{"$f":"$V$42*AE43","v":1.7103281250000003E-3},null,{"$f":"AF43","v":1.7103281250000003E-3}]
[]
[null,null,null,null,null,null,null,null,null,null,null,null,null,"1.2.2.2","Emission (quantity of dust emitted)",{"$f":"Weights!H76","v":0.75},{"$f":"L$21*P45","v":0.62193750000000003},null,"1.2.2.2.1","Paved roads and areas",{"$f":"Weights!L92","v":8.1000000000000003E-2},{"$f":"Q$45*U45","v":5.0376937500000003E-2},null,"1.2.2.2.1.1","Surface silt loading",{"$f":"Weights!M102","v":0.13600000000000001},{"$f":"$V$45*Z45","v":6.8512635000000013E-3},null,null,"High",{"$f":"Weights!H209","v":0.875},{"$f":"$AA$45*AE45","v":5.9948555625000009E-3},null,{"$f":"AF45","v":5.9948555625000009E-3}]
[null,null,null,null,null,null,null,null,null,null,null,null,null,null,null,null,null,null,null,null,null,null,null,null,null,null,null,null,null,"Low",{"$f":"Weights!H210","v":0.125},{"$f":"$AA$45*AE46","v":8.5640793750000016E-4},null,{"$f":"AF46","v":8.5640793750000016E-4}]
[]
[null,null,null,null,null,null,null,null,null,null,null,null,null,null,null,null,null,null,null,null,null,null,null,"1.2.2.2.1.2","Road surface moisture",{"$f":"Weights!M103","v":0.21299999999999999},{"$f":"$V$45*Z48","v":1.0730287687500001E-2},null,null,"Dry",{"$f":"Weights!H215","v":0.9},{"$f":"AA$48*AE48","v":9.6572589187500016E-3},null,{"$f":"AF48","v":9.6572589187500016E-3}]
[null,null,null,null,null,null,null,null,null,null,null,null,null,null,null,null,null,null,null,null,null,null,null,null,null,null,null,null,null,"Wet",{"$f":"Weights!H216","v":9.9999999999999978E-2},{"$f":"AA$48*AE49","v":1.0730287687499998E-3},null,{"$f":"AF49","v":1.0730287687499998E-3}]
[]
[null,null,null,null,null,null,null,null,null,null,null,null,null,null,null,null,null,null,null,null,null,null,null,"1.2.2.2.1.3","Vehicle weight",{"$f":"Weights!M104","v":0.03},{"$f":"$V$45*Z51","v":1.511308125E-3},null,null,"Heavy",{"$f":"Weights!H221","v":0.75},{"$f":"AA$51*AE51","v":1.1334810937499999E-3},null,{"$f":"AF51","v":1.1334810937499999E-3}]
[null,null,null,null,null,null,null,null,null,null,null,null,null,null,null,null,null,null,null,null,null,null,null,null,null,null,null,null,null,"Light",{"$f":"Weights!H222","v":0.25},{"$f":"AA$51*AE52","v":3.7782703125E-4},null,{"$f":"AF52","v":3.7782703125E-4}]
[]
[null,null,null,null,null,null,null,null,null,null,null,null,null,null,null,null,null,null,null,null,null,null,null,"1.2.2.2.1.4","Vehicle speed",{"$f":"Weights!M105","v":4.5999999999999999E-2},{"$f":"$V$45*Z54","v":2.3173391250000002E-3},null,null,"Fast",{"$f":"Weights!H227","v":0.75},{"$f":"AA$54*AE54","v":1.7380043437500003E-3},null,{"$f":"AF54","v":1.7380043437500003E-3}]
[null,null,null,null,null,null,null,null,null,null,null,null,null,null,null,null,null,null,null,null,null,null,null,null,null,null,null,null,null,"Slow",{"$f":"Weights!H228","v":0.25},{"$f":"AA$54*AE55","v":5.7933478125000006E-4},null,{"$f":"AF55","v":5.7933478125000006E-4}]
[]
[null,null,null,null,null,null,null,null,null,null,null,null,null,null,null,null,null,null,null,null,null,null,null,"1.2.2.2.1.5","Wind speed on road surface",{"$f":"Weights!M106","v":4.7E-2},{"$f":"$V$45*Z57","v":2.3677160625000001E-3},null,null,"High",{"$f":"Weights!I233","v":0.74299999999999999},{"$f":"AA$57*AE57","v":1.7592130344375001E-3},null,{"$f":"AF57","v":1.7592130344375001E-3}]
[null,null,null,null,null,null,null,null,null,null,null,null,null,null,null,null,null,null,null,null,null,null,null,null,null,null,null,null,null,"Medium ",{"$f":"Weights!I234","v":0.19400000000000001},{"$f":"AA$57*AE58","v":4.5933691612500005E-4},null,{"$f":"AF58","v":4.5933691612500005E-4}]
[null,null,null,null,null,null,null,null,null,null,null,null,null,null,null,null,null,null,null,null,null,null,null,null,null,null,null,null,null,"Low",{"$f":"Weights!I235","v":6.3E-2},{"$f":"AA$57*AE59","v":1.4916611193750001E-4},null,{"$f":"AF59","v":1.4916611193750001E-4}]
[]
[null,null,null,null,null,null,null,null,null,null,null,null,null,null,null,null,null,null,null,null,null,null,null,"1.2.2.2.1.6","Dust Particle size",{"$f":"Weights!M107","v":8.8999999999999996E-2},{"$f":"$V$45*Z61","v":4.4835474374999998E-3},null,null,"Fine",{"$f":"Weights!I240","v":0.105},{"$f":"AA$61*AE61","v":4.7077248093749995E-4},null,{"$f":"AF61","v":4.7077248093749995E-4}]
[null,null,null,null,null,null,null,null,null,null,null,null,null,null,null,null,null,null,null,null,null,null,null,null,null,null,null,null,null,"Medium",{"$f":"Weights!I241","v":0.25800000000000001},{"$f":"AA$61*AE62","v":1.1567552388750001E-3},null,{"$f":"AF62","v":1.1567552388750001E-3}]
[null,null,null,null,null,null,null,null,null,null,null,null,null,null,null,null,null,null,null,null,null,null,null,null,null,null,null,null,null,"Coarse",{"$f":"Weights!I242","v":0.63700000000000001},{"$f":"AA$61*AE63","v":2.8560197176875001E-3},null,{"$f":"AF63","v":2.8560197176875001E-3}]
[]
[null,null,null,null,null,null,null,null,null,null,null,null,null,null,null,null,null,null,null,null,null,null,null,"1.2.2.2.1.7","VKT",{"$f":"Weights!M108","v":0.439},{"$f":"$V$45*Z65","v":2.21154755625E-2},null,null,"Large",{"$f":"Weights!I247","v":0.63700000000000001},{"$f":"AA$65*AE65","v":1.4087557933312501E-2},null,{"$f":"AF65","v":1.4087557933312501E-2}]
[null,null,null,null,null,null,null,null,null,null,null,null,null,null,null,null,null,null,null,null,null,null,null,null,null,null,null,null,null,"Moderate",{"$f":"Weights!I248","v":0.25800000000000001},{"$f":"AA$65*AE66","v":5.7057926951250004E-3},null,{"$f":"AF66","v":5.7057926951250004E-3}]
[null,null,null,null,null,null,null,null,null,null,null,null,null,null,null,null,null,null,null,null,null,null,null,null,null,null,null,null,null,"Small",{"$f":"Weights!I249","v":0.105},{"$f":"AA$65*AE67","v":2.3221249340625002E-3},null,{"$f":"AF67","v":2.3221249340625002E-3}]
[]
[]
[null,null,null,null,null,null,null,null,null,null,null,null,null,null,null,null,null,null,"1.2.2.2.2","Unpaved roads and areas",{"$f":"Weights!L93","v":0.27},{"$f":"Q$45*U70","v":0.16792312500000001},null,null,"Surface silt loading",{"$f":"Weights!M113","v":0.105},{"$f":"V$70*Z70","v":1.7631928125000002E-2},null,null,"High",0.8,{"$f":"AA70*AE70","v":1.4105542500000002E-2},null,{"$f":"AF70","v":1.4105542500000002E-2}]
[null,null,null,null,null,null,null,null,null,null,null,null,null,null,null,null,null,null,null,null,null,null,null,null,null,null,null,null,null,"Low",0.2,{"$f":"AA70*AE71","v":3.5263856250000005E-3},null,{"$f":"AF71","v":3.5263856250000005E-3}]
[]
[null,null,null,null,null,null,null,null,null,null,null,null,null,null,null,null,null,null,null,null,null,null,null,null,"Road surface moisture",{"$f":"Weights!M114","v":0.17299999999999999},{"$f":"V$70*Z73","v":2.9050700624999998E-2},null,null,"Dry",0.9,{"$f":"AA73*AE73","v":2.6145630562499998E-2},null,{"$f":"AF73","v":2.6145630562499998E-2}]
[null,null,null,null,null,null,null,null,null,null,null,null,null,null,null,null,null,null,null,null,null,null,null,null,null,null,null,null,null,"Wet",0.1,{"$f":"AA73*AE74","v":2.9050700625E-3},null,{"$f":"AF74","v":2.9050700625E-3}]
[]
[null,null,null,null,null,null,null,null,null,null,null,null,null,null,null,null,null,null,null,null,null,null,null,null,"Vehicle weight",{"$f":"Weights!M115","v":0.155},{"$f":"V$70*Z76","v":2.6028084375E-2},null,null,"Heavy",0.6,{"$f":"AA76*AE76","v":1.5616850625E-2},null,{"$f":"AF76","v":1.5616850625E-2}]
[null,null,null,null,null,null,null,null,null,null,null,null,null,null,null,null,null,null,null,null,null,null,null,null,null,null,null,null,null,"Light",0.4,{"$f":"AA76*AE77","v":1.041123375E-2},null,{"$f":"AF77","v":1.041123375E-2}]
[]
[null,null,null,null,null,null,null,null,null,null,null,null,null,null,null,null,null,null,null,null,null,null,null,null,"Vehicle speed",{"$f":"Weights!M116","v":3.4000000000000002E-2},{"$f":"V$70*Z79","v":5.7093862500000011E-3},null,null,"Fast",0.7,{"$f":"AA79*AE79","v":3.9965703750000003E-3},null,{"$f":"AF79","v":3.9965703750000003E-3}]
[null,null,null,null,null,null,null,null,null,null,null,null,null,null,null,null,null,null,null,null,null,null,null,null,null,null,null,null,null,"Slow",0.3,{"$f":"AA79*AE80","v":1.7128158750000003E-3},null,{"$f":"AF80","v":1.7128158750000003E-3}]
[]
[null,null,null,null,null,null,null,null,null,null,null,null,null,null,null,null,null,null,null,null,null,null,null,null,"Wind speed on road surface",{"$f":"Weights!M117","v":3.2000000000000001E-2},{"$f":"V$70*Z82","v":5.3735400000000004E-3},null,null,"High",0.6,{"$f":"AA82*AE82","v":3.2241240000000001E-3},null,{"$f":"AF82","v":3.2241240000000001E-3}]
[null,null,null,null,null,null,null,null,null,null,null,null,null,null,null,null,null,null,null,null,null,null,null,null,null,null,null,null,null,"Medium ",0.3,{"$f":"AA82*AE83","v":1.612062E-3},null,{"$f":"AF83","v":1.612062E-3}]
[null,null,null,null,null,null,null,null,null,null,null,null,null,null,null,null,null,null,null,null,null,null,null,null,null,null,null,null,null,"Low",0.1,{"$f":"AA82*AE84","v":5.3735400000000009E-4},null,{"$f":"AF84","v":5.3735400000000009E-4}]
[]
[null,null,null,null,null,null,null,null,null,null,null,null,null,null,null,null,null,null,null,null,null,null,null,null,"Dust Particle size",{"$f":"Weights!M118","v":8.3000000000000004E-2},{"$f":"V$70*Z86","v":1.3937619375000002E-2},null,null,"Fine",0.1,{"$f":"AA86*AE86","v":1.3937619375000002E-3},null,{"$f":"AF86","v":1.3937619375000002E-3}]
[null,null,null,null,null,null,null,null,null,null,null,null,null,null,null,null,null,null,null,null,null,null,null,null,null,null,null,null,null,"Medium",0.3,{"$f":"AA86*AE87","v":4.1812858125000003E-3},null,{"$f":"AF87","v":4.1812858125000003E-3}]
[null,null,null,null,null,null,null,null,null,null,null,null,null,null,null,null,null,null,null,null,null,null,null,null,null,null,null,null,null,"Coarse",0.6,{"$f":"AA86*AE88","v":8.3625716250000006E-3},null,{"$f":"AF88","v":8.3625716250000006E-3}]
[]
[null,null,null,null,null,null,null,null,null,null,null,null,null,null,null,null,null,null,null,null,null,null,null,null,"VKT",{"$f":"Weights!M119","v":0.41799999999999998},{"$f":"V$70*Z90","v":7.0191866249999998E-2},null,null,"Small",0.1,{"$f":"AA90*AE90","v":7.0191866249999998E-3},null,{"$f":"AF90","v":7.0191866249999998E-3}]
[null,null,null,null,null,null,null,null,null,null,null,null,null,null,null,null,null,null,null,null,null,null,null,null,null,null,null,null,null,"Moderate",0.3,{"$f":"AA90*AE91","v":2.1057559875E-2},null,{"$f":"AF91","v":2.1057559875E-2}]
[null,null,null,null,null,null,null,null,null,null,null,null,null,null,null,null,null,null,null,null,null,null,null,null,null,null,null,null,null,"Large",0.6,{"$f":"AA90*AE92","v":4.2115119749999999E-2},null,{"$f":"AF92","v":4.2115119749999999E-2}]
[]
[]
[null,null,null,null,null,null,null,null,null,null,null,null,null,null,null,null,null,null,"1.2.2.2.3","Material transport ",{"$f":"Weights!L94","v":5.5E-2},{"$f":"Q$45*U95","v":3.4206562500000003E-2},null,null,"Surface silt loading",{"$f":"Weights!K124","v":0.11700000000000001},{"$f":"V95*Z95","v":4.0021678125000005E-3},null,null,"High",0.8,{"$f":"AA95*AE95","v":3.2017342500000007E-3},null,{"$f":"AF95","v":3.2017342500000007E-3}]
[null,null,null,null,null,null,null,null,null,null,null,null,null,null,null,null,null,null,null,null,null,null,null,null,null,null,null,null,null,"Low",0.2,{"$f":"AA95*AE96","v":8.0043356250000016E-4},null,{"$f":"AF96","v":8.0043356250000016E-4}]
[]
[null,null,null,null,null,null,null,null,null,null,null,null,null,null,null,null,null,null,null,null,null,null,null,null,"Material moisture",{"$f":"Weights!K125","v":0.191},{"$f":"V95*Z98","v":6.5334534375000005E-3},null,null,"Dry",0.9,{"$f":"AA98*AE98","v":5.8801080937500002E-3},null,{"$f":"AF98","v":5.8801080937500002E-3}]
[null,null,null,null,null,null,null,null,null,null,null,null,null,null,null,null,null,null,null,null,null,null,null,null,null,null,null,null,null,"Wet",0.1,{"$f":"AA98*AE99","v":6.5334534375000009E-4},null,{"$f":"AF99","v":6.5334534375000009E-4}]
[]
[null,null,null,null,null,null,null,null,null,null,null,null,null,null,null,null,null,null,null,null,null,null,null,"`","Vehicle speed",{"$f":"Weights!K126","v":4.9000000000000002E-2},{"$f":"V95*Z101","v":1.6761215625000002E-3},null,null,"Fast",0.7,{"$f":"AA101*AE101","v":1.17328509375E-3},null,{"$f":"AF101","v":1.17328509375E-3}]
[null,null,null,null,null,null,null,null,null,null,null,null,null,null,null,null,null,null,null,null,null,null,null,null,null,null,null,null,null,"Slow",0.3,{"$f":"AA101*AE102","v":5.0283646875000007E-4},null,{"$f":"AF102","v":5.0283646875000007E-4}]
[]
[null,null,null,null,null,null,null,null,null,null,null,null,null,null,null,null,null,null,null,null,null,null,null,null,"Wind speed on material surface",{"$f":"Weights!K127","v":4.1000000000000002E-2},{"$f":"V95*Z104","v":1.4024690625000001E-3},null,null,"High",0.6,{"$f":"AA104*AE104","v":8.4148143750000003E-4},null,{"$f":"AF104","v":8.4148143750000003E-4}]
[null,null,null,null,null,null,null,null,null,null,null,null,null,null,null,null,null,null,null,null,null,null,null,null,null,null,null,null,null,"Medium ",0.3,{"$f":"AA104*AE105","v":4.2074071875000001E-4},null,{"$f":"AF105","v":4.2074071875000001E-4}]
[null,null,null,null,null,null,null,null,null,null,null,null,null,null,null,null,null,null,null,null,null,null,null,null,null,null,null,null,null,"Low",0.1,{"$f":"AA104*AE106","v":1.4024690625000002E-4},null,{"$f":"AF106","v":1.4024690625000002E-4}]
[]
[null,null,null,null,null,null,null,null,null,null,null,null,null,null,null,null,null,null,null,null,null,null,null,null,"Quantity of material transported",{"$f":"Weights!K128","v":0.60199999999999998},{"$f":"V95*Z108","v":2.0592350625000002E-2},null,null,"Large",0.6,{"$f":"AA108*AE108","v":1.2355410375000001E-2},null,{"$f":"AF108","v":1.2355410375000001E-2}]
[null,null,null,null,null,null,null,null,null,null,null,null,null,null,null,null,null,null,null,null,null,null,null,null,null,null,null,null,null,"Moderate",0.3,{"$f":"AA108*AE109","v":6.1777051875000003E-3},null,{"$f":"AF109","v":6.1777051875000003E-3}]
[null,null,null,null,null,null,null,null,null,null,null,null,null,null,null,null,null,null,null,null,null,null,null,null,null,null,null,null,null,"Small",0.1,{"$f":"AA108*AE110","v":2.0592350625000004E-3},null,{"$f":"AF110","v":2.0592350625000004E-3}]
[]
[null,null,null,null,null,null,null,null,null,null,null,null,null,null,null,null,null,null,"1.2.2.2.4","Material transfer (drop operations)",{"$f":"Weights!L95","v":2.7E-2},{"$f":"Q$45*U112","v":1.67923125E-2},null,null,"Material moisture",{"$f":"Weights!K133","v":4.5999999999999999E-2},{"$f":"V112*Z112","v":7.72446375E-4},null,null,"Dry",0.9,{"$f":"AA112*AE112","v":6.9520173749999998E-4},null,{"$f":"AF112","v":6.9520173749999998E-4}]
[null,null,null,null,null,null,null,null,null,null,null,null,null,null,null,null,null,null,null,"Eq. 1 / Section 13.2.4",null,null,null,null,null,null,null,null,null,"Wet",0.1,{"$f":"AA112*AE113","v":7.7244637500000008E-5},null,{"$f":"AF113","v":7.7244637500000008E-5}]
[]
[null,null,null,null,null,null,null,null,null,null,null,null,null,null,null,null,null,null,null,null,null,null,null,null,"Wind speed on material surface",{"$f":"Weights!K134","v":0.28199999999999997},{"$f":"V112*Z115","v":4.7354321249999994E-3},null,null,"High",0.6,{"$f":"AA115*AE115","v":2.8412592749999994E-3},null,{"$f":"AF115","v":2.8412592749999994E-3}]
[null,null,null,null,null,null,null,null,null,null,null,null,null,null,null,null,null,null,null,null,null,null,null,null,null,null,null,null,null,"Medium ",0.3,{"$f":"AA115*AE116","v":1.4206296374999997E-3},null,{"$f":"AF116","v":1.4206296374999997E-3}]
[null,null,null,null,null,null,null,null,null,null,null,null,null,null,null,null,null,null,null,null,null,null,null,null,null,null,null,null,null,"Low",0.1,{"$f":"AA115*AE117","v":4.7354321249999995E-4},null,{"$f":"AF117","v":4.7354321249999995E-4}]
[]
[null,null,null,null,null,null,null,null,null,null,null,null,null,null,null,null,null,null,null,null,null,null,null,null,"Dust Particle size",{"$f":"Weights!K135","v":2.9000000000000001E-2},{"$f":"V112*Z119","v":4.869770625E-4},null,null,"Fine",0.1,{"$f":"AA119*AE119","v":4.8697706250000002E-5},null,{"$f":"AF119","v":4.8697706250000002E-5}]
[null,null,null,null,null,null,null,null,null,null,null,null,null,null,null,null,null,null,null,null,null,null,null,null,null,null,null,null,null,"Medium",0.3,{"$f":"AA119*AE120","v":1.4609311874999998E-4},null,{"$f":"AF120","v":1.4609311874999998E-4}]
[null,null,null,null,null,null,null,null,null,null,null,null,null,null,null,null,null,null,null,null,null,null,null,null,null,null,null,null,null,"Coarse",0.6,{"$f":"AA119*AE121","v":2.9218623749999997E-4},null,{"$f":"AF121","v":2.9218623749999997E-4}]
[]
[null,null,null,null,null,null,null,null,null,null,null,null,null,null,null,null,null,null,null,null,null,null,null,null,"Drop height",{"$f":"Weights!K136","v":0.17599999999999999},{"$f":"V112*Z123","v":2.9554469999999999E-3},null,null,"High",0.6,{"$f":"AA123*AE123","v":1.7732681999999998E-3},null,{"$f":"AF123","v":1.7732681999999998E-3}]
[null,null,null,null,null,null,null,null,null,null,null,null,null,null,null,null,null,null,null,null,null,null,null,null,null,null,null,null,null,"Medium",0.3,{"$f":"AA123*AE124","v":8.8663409999999989E-4},null,{"$f":"AF124","v":8.8663409999999989E-4}]
[null,null,null,null,null,null,null,null,null,null,null,null,null,null,null,null,null,null,null,null,null,null,null,null,null,null,null,null,null,"Small",0.1,{"$f":"AA123*AE125","v":2.9554470000000004E-4},null,{"$f":"AF125","v":2.9554470000000004E-4}]
[]
[null,null,null,null,null,null,null,null,null,null,null,null,null,null,null,null,null,null,null,null,null,null,null,null,"Quantity of material disturbed",{"$f":"Weights!K137","v":0.46600000000000003},{"$f":"V112*Z127","v":7.8252176250000003E-3},null,null,"High",0.6,{"$f":"AA127*AE127","v":4.6951305750000004E-3},null,{"$f":"AF127","v":4.6951305750000004E-3}]
[null,null,null,null,null,null,null,null,null,null,null,null,null,null,null,null,null,null,null,null,null,null,null,null,null,null,null,null,null,"Medium ",0.3,{"$f":"AA127*AE128","v":2.3475652875000002E-3},null,{"$f":"AF128","v":2.3475652875000002E-3}]
[null,null,null,null,null,null,null,null,null,null,null,null,null,null,null,null,null,null,null,null,null,null,null,null,null,null,null,null,null,"Low",0.1,{"$f":"AA127*AE129","v":7.825217625000001E-4},null,{"$f":"AF129","v":7.825217625000001E-4}]
[]
[null,null,null,null,null,null,null,null,null,null,null,null,null,null,null,null,null,null,"1.2.2.2.5","Stockpiles",{"$f":"Weights!L96","v":8.4000000000000005E-2},{"$f":"Q$45*U131","v":5.2242750000000004E-2},null,null,"Material moisture - surface layer",{"$f":"Weights!K142","v":9.8000000000000004E-2},{"$f":"V131*Z131","v":5.1197895000000011E-3},null,null,"Dry",0.9,{"$f":"AA131*AE131","v":4.6078105500000008E-3},null,{"$f":"AF131","v":4.6078105500000008E-3}]
[null,null,null,null,null,null,null,null,null,null,null,null,null,null,null,null,null,null,null,null,null,null,null,null,null,null,null,null,null,"Wet",0.1,{"$f":"AA131*AE132","v":5.1197895000000017E-4},null,{"$f":"AF132","v":5.1197895000000017E-4}]
[]
[null,null,null,null,null,null,null,null,null,null,null,null,null,null,null,null,null,null,null,null,null,null,null,null,"Wind speed on material surface",{"$f":"Weights!K143","v":5.3999999999999999E-2},{"$f":"V131*Z134","v":2.8211085000000003E-3},null,null,"High",0.6,{"$f":"AA134*AE134","v":1.6926651000000001E-3},null,{"$f":"AF134","v":1.6926651000000001E-3}]
[null,null,null,null,null,null,null,null,null,null,null,null,null,null,null,null,null,null,null,null,null,null,null,null,null,null,null,null,null,"Medium ",0.3,{"$f":"AA134*AE135","v":8.4633255000000007E-4},null,{"$f":"AF135","v":8.4633255000000007E-4}]
[null,null,null,null,null,null,null,null,null,null,null,null,null,null,null,null,null,null,null,null,null,null,null,null,null,null,null,null,null,"Low",0.1,{"$f":"AA134*AE136","v":2.8211085000000004E-4},null,{"$f":"AF136","v":2.8211085000000004E-4}]
[]
[null,null,null,null,null,null,null,null,null,null,null,null,null,null,null,null,null,null,null,null,null,null,null,null,"Dust Particle size",{"$f":"Weights!K144","v":0.105},{"$f":"V131*Z138","v":5.4854887500000006E-3},null,null,"Fine",0.1,{"$f":"AA138*AE138","v":5.4854887500000013E-4},null,{"$f":"AF138","v":5.4854887500000013E-4}]
[null,null,null,null,null,null,null,null,null,null,null,null,null,null,null,null,null,null,null,null,null,null,null,null,null,null,null,null,null,"Medium",0.3,{"$f":"AA138*AE139","v":1.6456466250000001E-3},null,{"$f":"AF139","v":1.6456466250000001E-3}]
[null,null,null,null,null,null,null,null,null,null,null,null,null,null,null,null,null,null,null,null,null,null,null,null,null,null,null,null,null,"Coarse",0.6,{"$f":"AA138*AE140","v":3.2912932500000001E-3},null,{"$f":"AF140","v":3.2912932500000001E-3}]
[]
[null,null,null,null,null,null,null,null,null,null,null,null,null,null,null,null,null,null,null,null,null,null,null,null,"Frequency of disturbance",{"$f":"Weights!K145","v":0.28199999999999997},{"$f":"V131*Z142","v":1.47324555E-2},null,null,"High",0.6,{"$f":"AA142*AE142","v":8.8394732999999993E-3},null,{"$f":"AF142","v":8.8394732999999993E-3}]
[null,null,null,null,null,null,null,null,null,null,null,null,null,null,null,null,null,null,null,null,null,null,null,null,null,null,null,null,null,"Medium ",0.3,{"$f":"AA142*AE143","v":4.4197366499999996E-3},null,{"$f":"AF143","v":4.4197366499999996E-3}]
[null,null,null,null,null,null,null,null,null,null,null,null,null,null,null,null,null,null,null,null,null,null,null,null,null,null,null,null,null,"Low",0.1,{"$f":"AA142*AE144","v":1.4732455500000002E-3},null,{"$f":"AF144","v":1.4732455500000002E-3}]
[]
[null,null,null,null,null,null,null,null,null,null,null,null,null,null,null,null,null,null,null,null,null,null,null,null,"Area of the pile",{"$f":"Weights!K146","v":0.46100000000000002},{"$f":"Z146*V131","v":2.4083907750000005E-2},null,null,"High",0.6,{"$f":"AA146*AE146","v":1.4450344650000002E-2},null,{"$f":"AF146","v":1.4450344650000002E-2}]
[null,null,null,null,null,null,null,null,null,null,null,null,null,null,null,null,null,null,null,null,null,null,null,null,null,null,null,null,null,"Medium ",0.3,{"$f":"AA146*AE147","v":7.2251723250000011E-3},null,{"$f":"AF147","v":7.2251723250000011E-3}]
[null,null,null,null,null,null,null,null,null,null,null,null,null,null,null,null,null,null,null,null,null,null,null,null,null,null,null,null,null,"Low",0.1,{"$f":"AA146*AE148","v":2.4083907750000006E-3},null,{"$f":"AF148","v":2.4083907750000006E-3}]
[]
[null,null,null,null,null,null,null,null,null,null,null,null,null,null,null,null,null,null,"1.2.2.2.6","Process emissions",{"$f":"Weights!L97","v":0.48299999999999998},{"$f":"Q$45*U150","v":0.30039581250000003},null,null,"Dust Particle size",{"$f":"Weights!I150","v":8.1000000000000003E-2},{"$f":"Z150*V150","v":2.4332060812500004E-2},null,null,"Fine",0.1,{"$f":"AA150*AE150","v":2.4332060812500005E-3},null,{"$f":"AF150","v":2.4332060812500005E-3}]
[null,null,null,null,null,null,null,null,null,null,null,null,null,null,null,null,null,null,null,null,null,null,null,null,null,null,null,null,null,"Medium",0.3,{"$f":"AA150*AE151","v":7.299618243750001E-3},null,{"$f":"AF151","v":7.299618243750001E-3}]
[null,null,null,null,null,null,null,null,null,null,null,null,null,null,null,null,null,null,null,null,null,null,null,null,null,null,null,null,null,"Coarse",0.6,{"$f":"AA150*AE152","v":1.4599236487500002E-2},null,{"$f":"AF152","v":1.4599236487500002E-2}]
[]
[null,null,null,null,null,null,null,null,null,null,null,null,null,null,null,null,null,null,null,null,null,null,null,null,"Intensity of disturbance",{"$f":"Weights!I151","v":0.188},{"$f":"V150*Z154","v":5.6474412750000008E-2},null,null,"High",0.6,{"$f":"AA154*AE154","v":3.3884647650000002E-2},null,{"$f":"AF154","v":3.3884647650000002E-2}]
[null,null,null,null,null,null,null,null,null,null,null,null,null,null,null,null,null,null,null,null,null,null,null,null,null,null,null,null,null,"Medium ",0.3,{"$f":"AA154*AE155","v":1.6942323825000001E-2},null,{"$f":"AF155","v":1.6942323825000001E-2}]
[null,null,null,null,null,null,null,null,null,null,null,null,null,null,null,null,null,null,null,null,null,null,null,null,null,null,null,null,null,"Low",0.1,{"$f":"AA154*AE156","v":5.6474412750000015E-3},null,{"$f":"AF156","v":5.6474412750000015E-3}]
[]
[null,null,null,null,null,null,null,null,null,null,null,null,null,null,null,null,null,null,null,null,null,null,null,null,"Amount of material disturbed",{"$f":"Weights!I152","v":0.73099999999999998},{"$f":"V150*Z158","v":0.21958933893750002},null,null,"High",0.6,{"$f":"AA158*AE158","v":0.1317536033625},null,{"$f":"AF158","v":0.1317536033625}]
[null,null,null,null,null,null,null,null,null,null,null,null,null,null,null,null,null,null,null,null,null,null,null,null,null,null,null,null,null,"Medium ",0.3,{"$f":"AA158*AE159","v":6.587680168125E-2},null,{"$f":"AF159","v":6.587680168125E-2}]
[null,null,null,null,null,null,null,null,null,null,null,null,null,null,null,null,null,null,null,null,null,null,null,null,null,null,null,null,null,"Low",0.1,{"$f":"AA158*AE160","v":2.1958933893750004E-2},null,{"$f":"AF160","v":2.1958933893750004E-2}]

{"sheet":"Weights","index":5,"n_rows":250,"n_cols":17,"rows_kept":250,"cut":false,"hidden":true,"merged":[[17,2,18,3],[17,4,18,11],[19,2,23,3],[19,4,23,6],[19,7,23,11],[14,2,14,3],[14,4,14,6],[14,7,14,11],[15,2,16,3],[15,4,16,6],[15,7,16,11],[11,2,11,3],[11,4,11,6],[11,7,11,11],[12,2,13,3],[12,4,13,6],[12,7,13,11],[8,2,8,3],[8,4,8,6],[8,7,8,11],[9,2,10,3],[9,4,10,6],[9,7,10,11],[5,2,5,3],[5,4,5,6],[5,7,5,11],[6,2,7,3],[6,4,7,6],[6,7,7,11],[1,2,2,3],[1,4,2,6],[1,7,2,11],[3,2,4,3],[3,4,4,6],[3,7,4,11]]}
[]
[null,null,"Intensity of Importance on a absolute scale",null,"Definition",null,null,"Explanation"]
[]
[null,null,1,null,"Equal importance",null,null,"Two activities contribute equally to the objective"]
[]
[null,null,2,null,"Weak or slight"]
[null,null,3,null,"Moderate importance of one over another",null,null,"Experience and judgment strongly favor one activity over another"]
[]
[null,null,4,null,"Moderate plus"]
[null,null,5,null,"Strong importance",null,null,"Experience and judgement strongly favor one activity over another"]
[]
[null,null,6,null,"Strong plus"]
[null,null,7,null,"Very strong or demonstrated importance",null,null,"An activity is favoured very strongly over another; its dominance demonstrated in practice"]
[]
[null,null,8,null,"Very, very strong"]
[null,null,9,null,"Extreme importance",null,null,"The evidence favoring one activity over another is of the highest possible order of affirmation"]
[]
[null,null,"Reciprocals of above",null,"If activity i has one of the above non-zero numbers assigned to it when compared with activity j, then j has the reciprocal value when compared with i"]
[]
[null,null,"1.1 - 1.9",null,"If the activities are very close",null,null,"May be difficult to assign the best value but when compared with other contrasting activities the size of the small numbers would not be too noticeable, yet they can still indicate the relative importance of the activities."]
[]
[]
[]
[]
[null,null,"Source:","Saaty, Thomas L., 2008. Decision making with the Analytic Hierarchy Process. Int. J. Services Sciences, Vol 1, No. 1, 83-98."]
[]
[]
[null,"1 - Risks of non compliance and complaints"]
[null,null,"Criteria",null,1,2,null,"W Norm.",null,"n = ",2]
[null,null,"Health effects",1,1,{"$f":"1/3","v":0.33333333333333331},null,{"$f":"IF(F30<E31,1/(1/F30+1),F30/(F30+1))","v":0.25},null,"CI (table) =","NA"]
[null,null,"Aesthetic effects",2,{"$f":"1/F30","v":3},1,null,{"$f":"1-H30","v":0.75},null,"L max = ",2]
[]
[]
[null,"1.1 - Health effects"]
[null,null,"Criteria",null,1,2,3,4,null,"W Norm.",null,"n = ",4]
[null,null,"Receptor sensitivity (health)",1,1,0.2,0.2,0.14285714285714285,null,4.7E-2,null,"CI (table) =",0.9]
[null,null,"Dust toxicity (composition)",2,5,1,0.5,0.2,null,0.14000000000000001,null,"L max = ",4.2690000000000001]
[null,null,"Dust particle size",3,5,2,1,0.2,null,0.19600000000000001,null,"CI =",8.9666666666666714E-2]
[null,null,"Quantity of dust at the receptor",4,7,5,5,1,null,0.61699999999999999,null,"CR = ",9.9629629629629679E-2,"Weights are reasonable values"]
[]
[]
[null,"1.2 - Aesthetic effects"]
[null,null,"Criteria",null,1,2,null,"W Norm.",null,"n = ",2]
[null,null,"Receptor sensitivity (welfare)",1,1,{"$f":"1/9","v":0.1111111111111111},null,{"$f":"IF(F44<E45,1/(1/F44+1),F44/(F44+1))","v":0.1},null,"CI (table) =","NA"]
[null,null,"Quantity of dust at the receptor",2,{"$f":"1/F44","v":9},1,null,{"$f":"1-H44","v":0.9},null,"L max = ",2]
[]
[]
[null,"1.2.1 - Receptor sensitivity (health)"]
[null,null,"Criteria",null,1,2,null,"W Norm.",null,"n = ",2]
[null,null,"Sensitive",1,1,5,null,{"$f":"IF(F50<E51,1/(1/F50+1),F50/(F50+1))","v":0.83333333333333337},null,"CI (table) =","NA"]
[null,null,"Non Sensitive",2,{"$f":"1/F50","v":0.2},1,null,{"$f":"1-H50","v":0.16666666666666663},null,"L max = ",2]
[]
[]
[null,"1.2.2 - Dust toxicity (composition)"]
[null,null,"Criteria",null,1,2,3,null,"W Norm.",null,"n = ",3,null,null,null,null,"Intensities"]
[null,null,"Heavy metals",1,1,7,9,null,0.78500000000000003,null,"CI (table) =",0.57999999999999996,null,null,null,null,{"$f":"I56/MAX(I56:I58)","v":1}]
[null,null,"Metals",2,0.14285714285714285,1,3,null,0.78500000000000003,null,"L max = ",3.081,null,null,null,null,{"$f":"I57/MAX(I56:I58)","v":1}]
[null,null,"No metals",3,0.1111111111111111,0.33333333333333331,1,null,6.6000000000000003E-2,null,"CI =",4.049999999999998E-2,null,null,null,null,{"$f":"I58/MAX(I56:I58)","v":8.4076433121019103E-2}]
[null,null,null,null,null,null,null,null,null,null,"CR = ",6.9827586206896525E-2,"Weights are reasonable values"]
[]
[null,"1.2.3 - Dust particle size"]
[null,null,"Criteria",null,1,2,3,null,"W Norm.",null,"n = ",3,null,null,null,null,"Intensities"]
[null,null,"Fine",1,1,5,7,null,0.73099999999999998,null,"CI (table) =",0.57999999999999996,null,null,null,null,{"$f":"I63/MAX(I63:I65)","v":1}]
[null,null,"Medium",2,0.2,1,3,null,0.188,null,"L max = ",3.0649999999999999,null,null,null,null,{"$f":"I64/MAX(I63:I65)","v":0.25718194254445964}]
[null,null,"Coarse",3,0.14285714285714285,0.33333333333333331,1,null,8.1000000000000003E-2,null,"CI =",3.2499999999999973E-2,null,null,null,null,{"$f":"I65/MAX(I63:I65)","v":0.11080711354309167}]
[null,null,null,null,null,null,null,null,null,null,"CR = ",5.6034482758620649E-2,"Weights are reasonable values"]
[]
[null,"1.2.1 - Receptor sensitivity (welfare)"]
[null,null,"Criteria",null,1,2,null,"W Norm.",null,"n = ",2]
[null,null,"Sensitive",1,1,3,null,{"$f":"IF(F70<E71,1/(1/F70+1),F70/(F70+1))","v":0.75},null,"CI (table) =","NA"]
[null,null,"Non Sensitive",2,{"$f":"1/F70","v":0.33333333333333331},1,null,{"$f":"1-H70","v":0.25},null,"L max = ",2]
[]
[null,"1.2.2 - Quantity of dust at the receptor"]
[null,null,"Criteria",null,1,2,null,"W Norm.",null,"n = ",2]
[null,null,"Dispersion",1,1,{"$f":"1/3","v":0.33333333333333331},null,{"$f":"IF(F75<E76,1/(1/F75+1),F75/(F75+1))","v":0.25},null,"CI (table) =","NA"]
[null,null,"Emission (quantity of dust emitted)",2,3,1,null,{"$f":"1-H75","v":0.75},null,"L max = ",2]
[]
[]
[null,"1.2.2.1 - Dispersion"]
[null,null,"Criteria",null,1,2,3,4,5,6,7,null,"W Norm.",null,"n = ",7]
[null,null,"Dust particle size",1,1,0.14285714285714285,1,1,0.14285714285714285,2,2,null,0.06,null,"CI (table) =",1.32]
[null,null,"Distance source - receptor",2,7,1,7,7,1,8,9,null,0.36399999999999999,null,"L max = ",7.1680000000000001]
[null,null,"Wind breaks",3,1,0.14285714285714285,1,1,0.125,2,3,null,6.4000000000000001E-2,null,"CI =",2.8000000000000025E-2]
[null,null,"Wind speed",4,1,0.14285714285714285,1,1,0.125,1,1,null,4.9000000000000002E-2,null,"CR = ",2.1212121212121231E-2,"Weights are reasonable values"]
[null,null,"Wind direction",5,7,1,8,8,1,9,9,null,0.38700000000000001,"Rounded"]
[null,null,"Atmospheric stability",6,0.5,0.125,0.5,1,0.1111111111111111,1,2,null,4.2999999999999997E-2]
[null,null,"Precipitation",7,0.5,0.1111111111111111,0.33333333333333331,1,0.1111111111111111,0.5,1,null,3.3000000000000002E-2]
[]
[]
[null,"1.2.2.2 - Emission (quantity of dust emitted)"]
[null,null,"Criteria",null,1,2,3,4,5,6,null,"W Norm.",null,"n = ",6]
[null,null,"Paved roads and areas",1,1,0.14285714285714285,1,1,0.33333333333333331,5,8.1000000000000003E-2,{"$f":"K92","v":8.1000000000000003E-2},null,"CI (table) =",1.24]
[null,null,"Unpaved roads and areas",2,7,1,7,7,3,9,0.48299999999999998,{"$f":"K96","v":0.27},null,"L max = ",6.3789999999999996]
[null,null,"Material transport ",3,1,0.14285714285714285,1,0.33333333333333331,0.14285714285714285,3,5.5E-2,5.5E-2,null,"CI =",7.5799999999999909E-2]
[null,null,"Material transfer (drop operations)",4,1,0.14285714285714285,3,1,0.2,3,8.4000000000000005E-2,{"$f":"K97","v":2.7E-2},null,"CR = ",6.1129032258064445E-2,"Weights are reasonable values"]
[null,null,"Stockpiles",5,3,0.33333333333333331,7,5,1,9,0.27,{"$f":"K95","v":8.4000000000000005E-2}]
[null,null,"Process emissions",6,0.2,0.1111111111111111,0.33333333333333331,0.33333333333333331,0.1111111111111111,1,2.7E-2,{"$f":"K93","v":0.48299999999999998}]
[null,null,null,null,null,null,null,null,null,null,null,{"$f":"SUM(L92:L97)","v":1}]
[]
[null,"1.2.2.2.1 - Paved roads and areas"]
[null,null,"Criteria",null,1,2,3,4,5,6,7,null,"W Norm.",null,"n = ",7]
[null,null,"Surface silt loading",1,1,0.33333333333333331,3,5,5,2,0.2,null,0.13600000000000001,null,"CI (table) =",1.32]
[null,null,"Road surface moisture",2,3,1,5,3,6,3,0.33333333333333331,null,0.21299999999999999,null,"L max = ",7.5130000000000008]
[null,null,"Vehicle weight",3,0.33333333333333331,0.2,1,0.5,0.33333333333333331,0.2,0.1111111111111111,null,0.03,null,"CI =",8.5500000000000131E-2]
[null,null,"Vehicle speed",4,0.2,0.33333333333333331,2,1,1,0.33333333333333331,0.14285714285714285,null,4.5999999999999999E-2,null,"CR = ",6.4772727272727371E-2,"Weights are reasonable values"]
[null,null,"Wind speed on road surface",5,0.2,0.16666666666666666,3,1,1,0.5,0.14285714285714285,null,4.7E-2]
[null,null,"Dust Particle size",6,0.5,0.33333333333333331,5,3,2,1,0.14285714285714285,null,8.8999999999999996E-2]
[null,null,"VKT",7,5,3,9,7,7,7,1,null,0.439]
[]
[]
[null,"1.2.2.2.2 - Unpaved roads and areas"]
[null,null,"Criteria",null,1,2,3,4,5,6,7,null,"W Norm.",null,"n = ",7]
[null,null,"Surface silt loading",1,1,0.33333333333333331,0.33333333333333331,5,5,2,0.2,null,0.105,null,"CI (table) =",1.32]
[null,null,"Road surface moisture",2,3,1,0.5,5,6,3,0.33333333333333331,null,0.17299999999999999,null,"L max = ",7.5990000000000002]
[null,null,"Vehicle weight",3,3,2,1,3,3,1,0.2,null,0.155,null,"CI =",9.9833333333333371E-2]
[null,null,"Vehicle speed",4,0.2,0.2,0.33333333333333331,1,1,0.33333333333333331,0.14285714285714285,null,3.4000000000000002E-2,null,"CR = ",7.563131313131316E-2,"Weights are reasonable values"]
[null,null,"Wind speed on road surface",5,0.2,0.16666666666666666,0.33333333333333331,1,1,0.33333333333333331,0.1111111111111111,null,3.2000000000000001E-2]
[null,null,"Dust Particle size",6,0.5,0.33333333333333331,1,3,3,1,0.2,null,8.3000000000000004E-2]
[null,null,"VKT",7,5,3,5,7,9,5,1,null,0.41799999999999998]
[]
[]
[null,"1.2.2.2.3 - Material Transport"]
[null,null,"Criteria",null,1,2,3,4,5,null,"W Norm.",null,"n = ",5]
[null,null,"Surface silt loading",1,1,0.33333333333333331,3,5,0.14285714285714285,null,0.11700000000000001,null,"CI (table) =",1.1200000000000001]
[null,null,"Material moisture",2,3,1,3,5,0.2,null,0.191,null,"L max = ",5.3040000000000003]
[null,null,"Vehicle speed",3,0.33333333333333331,0.33333333333333331,1,1,0.1111111111111111,null,4.9000000000000002E-2,null,"CI =",7.6000000000000068E-2]
[null,null,"Wind speed on material surface",4,0.2,0.2,1,1,0.1111111111111111,null,4.1000000000000002E-2,null,"CR = ",6.7857142857142907E-2,"Weights are reasonable values"]
[null,null,"Quantity of material transported",5,7,5,9,9,1,null,0.60199999999999998]
[]
[]
[null,"1.2.2.2.4 - Material transfer (drop operations)"]
[null,null,"Criteria",null,1,2,3,4,5,null,"W Norm.",null,"n = ",5]
[null,null,"Material moisture",1,1,0.14285714285714285,3,0.14285714285714285,0.1111111111111111,null,4.5999999999999999E-2,null,"CI (table) =",1.1200000000000001]
[null,null,"Wind speed on material surface",2,7,1,8,3,0.33333333333333331,null,0.28199999999999997,null,"L max = ",5.4050000000000002]
[null,null,"Dust Particle size",3,0.33333333333333331,0.125,1,0.14285714285714285,0.1111111111111111,null,2.9000000000000001E-2,null,"CI =",0.10125000000000006]
[null,null,"Drop height",4,7,0.33333333333333331,7,1,0.33333333333333331,null,0.17599999999999999,null,"CR = ",9.0401785714285768E-2,"Weights are reasonable values"]
[null,null,"Quantity of material disturbed",5,9,3,9,3,1,null,0.46600000000000003]
[]
[]
[null,"1.2.2.2.5 - Stockpiles"]
[null,null,"Criteria",null,1,2,3,4,5,null,"W Norm.",null,"n = ",5]
[null,null,"Material moisture - surface layer",1,1,3,1,0.2,0.2,null,9.8000000000000004E-2,null,"CI (table) =",1.1200000000000001]
[null,null,"Wind speed on material surface",2,0.33333333333333331,1,0.33333333333333331,0.33333333333333331,0.14285714285714285,null,5.3999999999999999E-2,null,"L max = ",5.2389999999999999]
[null,null,"Dust particle size",3,1,3,1,0.33333333333333331,0.2,null,0.105,null,"CI =",5.974999999999997E-2]
[null,null,"Frequency of disturbance",4,5,3,3,1,0.5,null,0.28199999999999997,null,"CR = ",5.3348214285714256E-2,"Weights are reasonable values"]
[null,null,"Area of the pile",5,5,7,5,2,1,null,0.46100000000000002]
[]
[null,"1.2.2.2.6 - Process Emissions"]
[null,null,"Criteria",null,1,2,3,null,"W Norm.",null,"n = ",3]
[null,null,"Dust Particle size",1,1,0.33333333333333331,0.14285714285714285,null,8.1000000000000003E-2,null,"CI (table) =",0.57999999999999996]
[null,null,"Intensity of disturbance",2,3,1,0.2,null,0.188,null,"L max = ",3.0649999999999999]
[null,null,"Amount of material disturbed",3,7,5,1,null,0.73099999999999998,null,"CI =",3.2499999999999973E-2]
[null,null,null,null,null,null,null,null,null,null,"CR = ",5.6034482758620649E-2,"Weights are reasonable values"]
[]
[null,"Relative amount of dust"]
[null,null,"Criteria",null,1,2,3,null,"W Norm.",null,"n = ",3]
[null,null,"High",1,1,3,5,null,0.63700000000000001,null,"CI (table) =",0.57999999999999996]
[null,null,"Medium",2,0.33333333333333331,1,3,null,0.25800000000000001,null,"L max = ",3.0390000000000001]
[null,null,"Low",3,0.2,0.33333333333333331,1,null,0.105,null,"CI =",1.9500000000000073E-2]
[null,null,null,null,null,null,null,null,null,null,"CR = ",3.3620689655172543E-2,"Weights are reasonable values"]
[]
[null,"1.2.2.1.1 - Dust particle size"]
[null,null,"Criteria",null,1,2,3,null,"W Norm.",null,"n = ",3]
[null,null,"Fine",1,1,4,7,null,0.70499999999999996,null,"CI (table) =",0.57999999999999996]
[null,null,"Medium",2,0.25,1,3,null,0.21099999999999999,null,"L max = ",3.0329999999999999]
[null,null,"Coarse",3,0.14285714285714285,0.33333333333333331,1,null,8.4000000000000005E-2,null,"CI =",1.6499999999999959E-2]
[null,null,null,null,null,null,null,null,null,null,"CR = ",2.8448275862068897E-2,"Weights are reasonable values"]
[]
[null,"1.2.2.1.2 - Distance source - receptor"]
[null,null,"Criteria",null,1,2,3,null,"W Norm.",null,"n = ",3]
[null,null,"Close",1,1,5,9,null,0.74299999999999999,null,"CI (table) =",0.57999999999999996,null,null,null,null,73.52]
[null,null,"Medium",2,0.2,1,4,null,0.19400000000000001,null,"L max = ",3.0720000000000001,null,null,null,null,19.940000000000001]
[null,null,"Far",3,0.1111111111111111,0.25,1,null,6.3E-2,null,"CI =",3.6000000000000032E-2,null,null,null,null,6.54]
[null,null,null,null,null,null,null,null,null,null,"CR = ",6.2068965517241441E-2,"Weights are reasonable values"]
[null,null,null,null,null,null,null,null,null,null,null,null,null,null,null,null,6.2E-2]
[null,"1.2.2.1.3 - Wind breaks"]
[null,null,"Criteria",null,1,2,null,"W Norm.",null,"n = ",2]
[null,null,"No",1,1,9,null,{"$f":"IF(F178<E179,1/(1/F178+1),F178/(F178+1))","v":0.9},null,"CI (table) =","NA"]
[null,null,"Yes",2,{"$f":"1/F178","v":0.1111111111111111},1,null,{"$f":"1-H178","v":9.9999999999999978E-2},null,"L max = ",2]
[]
[]
[null,"1.2.2.1.4 - Wind speed"]
[null,null,"Criteria",null,1,2,3,null,"W Norm.",null,"n = ",3]
[null,null,"Low",1,1,3,5,null,0.63700000000000001,null,"CI (table) =",0.57999999999999996,null,null,null,null,63.33]
[null,null,"Medium ",2,0.33333333333333331,1,3,null,0.25800000000000001,null,"L max = ",3.0389999999999997,null,null,null,null,26.05]
[null,null,"High",3,0.2,0.33333333333333331,1,null,0.105,null,"CI =",1.9499999999999851E-2,null,null,null,null,10.62]
[null,null,null,null,null,null,null,null,null,null,"CR = ",3.3620689655172162E-2,"Weights are reasonable values"]
[]
[null,"1.2.2.1.5 - Wind direction"]
[null,null,"Criteria",null,1,2,null,"W Norm.",null,"n = ",2]
[null,null,"Yes",1,1,9,null,{"$f":"IF(F191<E192,1/(1/F191+1),F191/(F191+1))","v":0.9},null,"CI (table) =","NA"]
[null,null,"No",2,{"$f":"1/F191","v":0.1111111111111111},1,null,{"$f":"1-H191","v":9.9999999999999978E-2},null,"L max = ",2]
[]
[]
[null,"1.2.2.1.6 - Atmospheric stability"]
[null,null,"Criteria",null,1,2,null,"W Norm.",null,"n = ",2]
[null,null,"Stable",1,1,5,null,{"$f":"IF(F197<E198,1/(1/F197+1),F197/(F197+1))","v":0.83333333333333337},null,"CI (table) =","NA"]
[null,null,"Not stable",2,{"$f":"1/F197","v":0.2},1,null,{"$f":"1-H197","v":0.16666666666666663},null,"L max = ",2]
[]
[]
[null,"1.2.2.1.7 - Precipitation"]
[null,null,"Criteria",null,1,2,null,"W Norm.",null,"n = ",2]
[null,null,"No",1,1,3,null,{"$f":"IF(F203<E204,1/(1/F203+1),F203/(F203+1))","v":0.75},null,"CI (table) =","NA"]
[null,null,"Yes",2,{"$f":"1/F203","v":0.33333333333333331},1,null,{"$f":"1-H203","v":0.25},null,"L max = ",2]
[]
[]
[null,"1.2.2.2.1.1 - Surface silt loading"]
[null,null,"Criteria",null,1,2,null,"W Norm.",null,"n = ",2]
[null,null,"High",1,1,7,null,{"$f":"IF(F209<E210,1/(1/F209+1),F209/(F209+1))","v":0.875},null,"CI (table) =","NA"]
[null,null,"Low",2,{"$f":"1/F209","v":0.14285714285714285},1,null,{"$f":"1-H209","v":0.125},null,"L max = ",2]
[]
[]
[null,"1.2.2.2.1.2 - Road surface moisture"]
[null,null,"Criteria",null,1,2,null,"W Norm.",null,"n = ",2]
[null,null,"Dry",1,1,9,null,{"$f":"IF(F215<E216,1/(1/F215+1),F215/(F215+1))","v":0.9},null,"CI (table) =","NA"]
[null,null,"Wet",2,{"$f":"1/F215","v":0.1111111111111111},1,null,{"$f":"1-H215","v":9.9999999999999978E-2},null,"L max = ",2]
[]
[]
[null,"1.2.2.2.1.3 - Vehicle weight"]
[null,null,"Criteria",null,1,2,null,"W Norm.",null,"n = ",2]
[null,null,"Heavy",1,1,3,null,{"$f":"IF(F221<E222,1/(1/F221+1),F221/(F221+1))","v":0.75},null,"CI (table) =","NA"]
[null,null,"Light",2,{"$f":"1/F221","v":0.33333333333333331},1,null,{"$f":"1-H221","v":0.25},null,"L max = ",2]
[]
[]
[null,"1.2.2.2.1.4 - Vehicle speed"]
[null,null,"Criteria",null,1,2,null,"W Norm.",null,"n = ",2]
[null,null,"Fast",1,1,3,null,{"$f":"IF(F227<E228,1/(1/F227+1),F227/(F227+1))","v":0.75},null,"CI (table) =","NA"]
[null,null,"Slow",2,{"$f":"1/F227","v":0.33333333333333331},1,null,{"$f":"1-H227","v":0.25},null,"L max = ",2]
[]
[]
[null,"1.2.2.2.1.5 - Wind speed on road surface"]
[null,null,"Criteria",null,1,2,3,null,"W Norm.",null,"n = ",3]
[null,null,"High",1,1,5,9,null,0.74299999999999999,null,"CI (table) =",0.57999999999999996]
[null,null,"Medium ",2,0.2,1,4,null,0.19400000000000001,null,"L max = ",3.0720000000000001]
[null,null,"Low",3,0.1111111111111111,0.25,1,null,6.3E-2,null,"CI =",3.6000000000000032E-2]
[null,null,null,null,null,null,null,null,null,null,"CR = ",6.2068965517241441E-2,"Weights are reasonable values"]
[]
[null,"1.2.2.2.1.6 - Dust Particle size"]
[null,null,"Criteria",null,1,2,3,null,"W Norm.",null,"n = ",3]
[null,null,"Fine",1,1,0.33333333333333331,0.2,null,0.105,null,"CI (table) =",0.57999999999999996]
[null,null,"Medium",2,3,1,0.33333333333333331,null,0.25800000000000001,null,"L max = ",3.0389999999999997]
[null,null,"Coarse",3,5,3,1,null,0.63700000000000001,null,"CI =",1.9499999999999851E-2]
[null,null,null,null,null,null,null,null,null,null,"CR = ",3.3620689655172162E-2,"Weights are reasonable values"]
[]
[null,"1.2.2.2.1.7 - VKT"]
[null,null,"Criteria",null,1,2,3,null,"W Norm.",null,"n = ",3]
[null,null,"Large",1,1,3,5,null,0.63700000000000001,null,"CI (table) =",0.57999999999999996]
[null,null,"Moderate",2,0.33333333333333331,1,3,null,0.25800000000000001,null,"L max = ",3.0389999999999997]
[null,null,"Small",3,0.2,0.33333333333333331,1,null,0.105,null,"CI =",1.9499999999999851E-2]
[null,null,null,null,null,null,null,null,null,null,"CR = ",3.3620689655172162E-2,"Weights are reasonable values"]