{"text_format":"1","workbook":"xlsx","n_sheets":6,"sheets":["DashBoard","1_Risk_Calc","2_Alternatives","Risk_Factors","Problem Hierarchy","Weights"],"not_rendered":{"charts":5,"images":2,"macros":1,"external_links":0,"defined_names":18,"comments":2,"pivot_tables":0},"unopened":[],"bounds":{"document_bytes":16777216,"sheet_cells":100000,"rows_first":2000,"rows_last":500,"rows_between":2000,"halvings":0,"cell_chars":16384,"cell_head_chars":4096},"cells_cut":0,"cells_raw":0,"read":"whole","date_system":"1900"}

{"sheet":"DashBoard","index":0,"n_rows":9,"n_cols":5,"rows_kept":9,"cut":false,"hidden":false,"merged":[]}
[]
[]
[]
[null,null,null,"Fugitive Dust Risk Management Tool"]
[]
[]
[null,null,null,"Step 1","Calculation of risks associated with fugitive dust sources"]
[]
[null,null,null,"Step 2","Assessment of alternatives for fugitive dust control"]

{"sheet":"1_Risk_Calc","index":1,"n_rows":214,"n_cols":35,"rows_kept":214,"cut":false,"hidden":false,"merged":[[112,16,112,27],[6,5,6,15],[7,16,7,28]]}
[null,"Fugitive Dust Risk Management Tool",null,null,null,"Source","Path","Path","Source","Receptor","Path / Receptor","Path","Source","Source","Source","Source",null,null,null,null,null,null,null,null,null,null,null,null,null,null,null,null,0,{"$f":"AC6","v":75},{"$f":"AC7","v":50}]
[null,null,null,null,null,null,null,null,null,null,null,null,null,null,null,null,null,null,null,null,null,null,null,null,null,null,null,null,null,null,null,null,100,{"$f":"AC6","v":75},{"$f":"AC7","v":50}]
[{"$f":"\"Step 1 - \"&DashBoard!E7","v":"Step 1 - Calculation of risks associated with fugitive dust sources"}]
[]
[null,null,"Cells to be populated",null,null,null,null,null,null,null,null,null,null,null,null,null,null,null,null,null,null,null,null,null,null,null,null,null,100,"Max:"]
[null,null,"Drop-down menu",null,null,null,null,null,null,null,null,null,null,null,null,null,null,null,null,null,null,null,null,null,null,null,null,null,75,"Red: >"]
[null,null,"Automatically",null,null,"Risk Factors",null,null,null,null,null,null,null,null,null,null,null,null,null,null,null,null,null,null,null,null,null,null,50,"Yellow: >"]
[null,null,null,null,null,1,2,3,4,5,6,7,8,9,10,11,"Risk Score"]
[null,"Source ID Number","Description of the structure / equipment","Location","Category","Frequency of process / activity that generates fugitive dust:","Position of the source related to sensitive areas (e.g.: communities, working areas):","Predominant wind direction is from the source to the closest sensible area?","Relative amount of visible dust generated in the process / activity:","Dust composition","Dust size range (higher mass percentage)","Is there some wind barrier (e.g.: trees, buldings, landscape) which can prevent the emissions from this source to reach the closest sensitive area?","Is there some measure applied on regular basis to prevent dust emission from this source (preventative)?","Is there some measure applied to this source to reduce dust emission once it occur (reactive)?","Is there some monitoring procedure applied to this source related to fugitive dust control?","Monitoring data / information trigger some control measure?","A","B","C","D","E","F","G","H","I","J","K","Total","Total Normal."]
[null,"S_001","WCS - Worst Case Scenario","—","Process","Continuous","Close","Yes","High ","Metals","Fine","No","No","No","No","No",{"$f":"IF(F10=0,\"\",INDEX(Risk_Factors!$O$12:$T$14,MATCH(F10,Frequency,0),MATCH($E10,Risk_Factors!$O$8:$T$8,0)))","v":0.1317536033625},{"$f":"IF(G10=0,\"\",INDEX(Risk_Factors!$O$15:$T$17,MATCH('1_Risk_Calc'!G10,Position,0),MATCH($E10,Risk_Factors!$O$8:$T$8,0)))","v":5.6068080250000006E-2},{"$f":"IF(H10=0,\"\",INDEX(Risk_Factors!$O$18:$T$19,MATCH('1_Risk_Calc'!H10,Yes_No,0),MATCH($E10,Risk_Factors!$O$8:$T$8,0)))","v":7.2206943750000002E-2},{"$f":"IF(I10=0,\"\",INDEX(Risk_Factors!$O$20:$T$22,MATCH('1_Risk_Calc'!I10,Dust_amount,0),MATCH($E10,Risk_Factors!$O$8:$T$8,0)))","v":3.8270426512500011E-2},{"$f":"IF(J10=0,\"\",INDEX(Risk_Factors!$O$23:$T$25,MATCH('1_Risk_Calc'!J10,Dust_composition,0),MATCH($E10,Risk_Factors!$O$8:$T$8,0)))","v":2.7475000000000003E-2},{"$f":"IF(K10=0,\"\",INDEX(Risk_Factors!$O$26:$T$28,MATCH('1_Risk_Calc'!K10,Dust_size,0),MATCH($E10,Risk_Factors!$O$8:$T$8,0)))","v":4.7021524831250001E-2},{"$f":"IF(L10=0,\"\",INDEX(Risk_Factors!$O$29:$T$30,MATCH('1_Risk_Calc'!L10,Risk_Factors!$E$29:$E$30,0),MATCH($E10,Risk_Factors!$O$8:$T$8,0)))","v":0.03},{"$f":"IF(M10=0,\"\",INDEX(Risk_Factors!$O$32:$T$33,MATCH('1_Risk_Calc'!M10,Risk_Factors!$E$32:$E$33,0),MATCH($E10,Risk_Factors!$O$8:$T$8,0)))","v":3.0039581250000003E-2},{"$f":"IF(N10=0,\"\",INDEX(Risk_Factors!$O$35:$T$36,MATCH('1_Risk_Calc'!N10,Risk_Factors!$E$35:$E$36,0),MATCH($E10,Risk_Factors!$O$8:$T$8,0)))","v":3.0039581250000003E-2},{"$f":"IF(O10=0,\"\",INDEX(Risk_Factors!$O$38:$T$39,MATCH('1_Risk_Calc'!O10,Risk_Factors!$E$38:$E$39,0),MATCH($E10,Risk_Factors!$O$8:$T$8,0)))","v":3.0039581250000003E-2},{"$f":"IF(P10=0,\"\",INDEX(Risk_Factors!$O$41:$T$42,MATCH('1_Risk_Calc'!P10,Risk_Factors!$E$41:$E$42,0),MATCH($E10,Risk_Factors!$O$8:$T$8,0)))","v":3.0039581250000003E-2},{"$f":"SUM(Q10:AA10)","v":0.52295390370625006},{"$f":"(AB10/MAX($AB$10:$AB$109))*$AC$5","v":100},null,null,null,{"$f":"B10","v":"S_001"},{"$f":"AC10","v":100}]
{"$rows_left_out":205}
{"sheet":"2_Alternatives","index":2,"n_rows":35,"n_cols":69,"rows_kept":35,"cut":false,"hidden":false,"merged":[[9,29,9,30],[9,31,10,31],[10,2,10,3],[8,1,9,1],[8,2,9,2],[8,3,9,3],[8,4,9,4],[8,5,8,15],[9,16,9,28]]}
[null,"Fugitive Dust Risk Management Tool",null,null,null,"Source","Path","Path","Source","Receptor","Path / Receptor","Path","Source","Source","Source","Source",null,null,null,null,null,null,null,null,null,null,null,null,null,null,null,null,null,null,null,null,0,{"$f":"AC9","v":50},{"$f":"AC8","v":75}]
[null,null,null,null,null,null,null,null,null,null,null,null,null,null,null,null,null,null,null,null,null,null,null,null,null,null,null,null,null,null,null,null,null,null,null,null,100,{"$f":"AC9","v":50},{"$f":"AC8","v":75}]
[{"$f":"\"Step 2 - \"&DashBoard!E9","v":"Step 2 - Assessment of alternatives for fugitive dust control"}]
[]
[null,null,"Cells to be populated"]
[null,null,"Drop-down menu",null,null,null,null,null,null,null,null,null,null,null,null,null,null,null,null,null,null,null,null,null,null,null,null,null,null,null,null,null,null,null,null,null,null,null,null,null,null,null,null,null,null,null,null,null,null,null,null,null,null,null,null,null,null,null,null,null,null,null,null,null,null,null,null,null," "]
[null,null,"Automatically",null,null,null,null,null,null,null,null,null,null,null,null,null,null,null,null,null,null,null,null,null,null,null,null,null,{"$f":"'1_Risk_Calc'!AC5","v":100},"Max:"]
[null,null,null,null,null,null,null,null,null,null,null,null,null,null,null,null,null,null,null,null,null,null,null,null,null,null,null,null,{"$f":"'1_Risk_Calc'!AC6","v":75},"Red: >"]
[null,"Source ID Number","Description of the structure / equipment","Location","Category","Risk Factors",null,null,null,null,null,null,null,null,null,null,null,null,null,null,null,null,null,null,null,null,null,null,{"$f":"'1_Risk_Calc'!AC7","v":50},"Yellow: >",null,null,null,null,null,null,null,null,null,null,null,null,null,null,null,null,null,null,null,null,null,null,null,null,"Risk Reduction Target",200,{"$f":"IF(MIN($AA$5:$AA$18)<0,ROUNDUP(MIN($AA$5:$AA$18),1)*1.1,0)","v":0}]
[null,null,null,null,null,"A","B","C","D","E","F","G","H","I","J","K","Risk Score",null,null,null,null,null,null,null,null,null,null,null,null,"Reduction",null,"Cost Benefit ($/ risk reduction)",null,null,null,null,null,null,null,null,null,null,null,null,null,null,null,null,null,null,null,null,null,null,null,200,{"$f":"SUM(AZ12)*2","v":0}]
{"$rows_left_out":26}
{"sheet":"Risk_Factors","index":3,"n_rows":148,"n_cols":21,"rows_kept":148,"cut":false,"hidden":false,"merged":[[14,2,16,2],[34,2,35,2],[76,3,78,3],[70,3,71,3],[72,3,73,3],[47,3,48,3],[37,3,38,3],[40,3,41,3],[63,3,64,3],[65,3,67,3],[57,3,58,3],[51,3,53,3],[54,3,56,3],[49,3,50,3],[25,2,27,2],[40,2,41,2],[11,3,13,3],[14,3,16,3],[31,3,32,3],[34,3,35,3],[28,3,29,3],[19,3,21,3],[22,3,24,3],[25,3,27,3],[28,2,29,2],[17,3,18,3],[19,2,21,2],[17,2,18,2],[22,2,24,2],[37,2,38,2],[6,8,6,13],[6,14,6,19],[82,8,82,13],[63,2,64,2],[65,2,67,2],[70,2,71,2],[72,2,73,2],[76,2,78,2],[11,2,13,2],[47,2,48,2],[51,2,53,2],[54,2,56,2],[57,2,58,2],[49,2,50,2],[31,2,32,2]]}
[]
["Factors Affecting the Risk of Non Compliance and Complaints Related to Dust Emissions "]
[]
[null,null,"S:","Factor related to the source of emissions (i.e., affects the amount of fugitive dust emitted)."]
[null,null,"P:","Factor related to the path of emissions between the source and receptors (i.e., affects dispersion)"]
[null,null,"R:","Factors related to the impact of the dust on the receptors"]
[null,null,null,null,null,null,null,null,"Weights",null,null,null,null,null,"Risk Score"]
[null,null,null,"Factor","Possible Conditions","Description","Points","Points Normalized",{"$f":"D123","v":"Unpaved road / area"},{"$f":"D124","v":"Paved road / area"},{"$f":"D125","v":"Material stockpile"},{"$f":"D126","v":"Material transfer (drop operations)"},{"$f":"D127","v":"Material transport (conveying, trucks)"},{"$f":"D128","v":"Process"},{"$f":"I8","v":"Unpaved road / area"},{"$f":"J8","v":"Paved road / area"},"Material stockpile","Material transfer (drop operations)","Material transport (conveying, trucks)",{"$f":"N8","v":"Process"}]
[]
[null,"Steady Conditions",null,null,null,null,null,null,null,null,null,null,null,null,{"$f":"SUM(O12,O15,O18,O20,O23,O26,O29,O32,O35,O38,O41,O48,O50,O52,O55,O58,O64,O71,O73,O77)","v":0.54240988056250017},{"$f":"SUM(P12,P15,P18,P20,P23,P26,P29,P32,P35,P38,P41,P48,P50,P52,P55,P58,P64,P71,P73,P77)","v":0.37946547000175013},0.393279191275,0.33148955924942503,0.36873429418749992,0.61295390370625003]
{"$rows_left_out":139}
{"sheet":"Problem Hierarchy","index":4,"n_rows":160,"n_cols":34,"rows_kept":160,"cut":false,"hidden":false,"merged":[]}
[null,"Dust Risk Hierarchy"]
[null,"Weights calculated according to the Analytic Hierarchy Process (Saaty, Thomas L., 2008)",null,null,null,null,null,null,null,null,null,null,null,null,null,null,null,null,null,null,null,null,null,null,null,null,null,null,null,null,null,null,null,0.02]
[null,"Level 1",null,null,"Level 2",null,null,null,"Level 3",null,null,null,null,null,"Level 4",null,null,null,null,"Level 5",null,null,null,null,"Level 6",null,null,null,null,"Alternatives"]
[null,null,null,null,null,{"$f":"SUM(F6:F998)","v":1},null,null,null,null,{"$f":"SUM(K6:K998)","v":1},null,null,null,null,null,null,null,null,null,null,null,null,null,null,null,null,null,null,null,null,null,null,{"$f":"SUM(AH6:AH998)","v":1.0222432076875005}]
[]
[1,"Minimize risks of non compliance and complaints",null,1.1000000000000001,"Minimize health effects",{"$f":"Weights!H30","v":0.25},null,"1.1.1","Receptor sensitivity (health)",{"$f":"Weights!J36","v":4.7E-2},{"$f":"F$6*J6","v":1.175E-2},null,null,null,null,null,null,null,null,null,null,null,null,null,null,null,null,null,null,"Sensitive",{"$f":"Weights!H50","v":0.83333333333333337},{"$f":"K6*AE6","v":9.7916666666666673E-3},null,{"$f":"AF6","v":9.7916666666666673E-3}]
[null,null,null,null,null,null,null,null,null,null,null,null,null,null,null,null,null,null,null,null,null,null,null,null,null,null,null,null,null,"Non Sensitive",{"$f":"Weights!H51","v":0.16666666666666663},{"$f":"K6*AE7","v":1.9583333333333328E-3},null,{"$f":"AF7","v":1.9583333333333328E-3}]
[]
[null,null,null,null,null,null,null,"1.1.2","Dust toxicity (composition)",{"$f":"Weights!J37","v":0.14000000000000001},{"$f":"F$6*J9","v":3.5000000000000003E-2},null,null,null,null,null,null,null,null,null,null,null,null,null,null,null,null,null,null,"Heavy metals",{"$f":"Weights!I56","v":0.78500000000000003},{"$f":"K$9*AE9","v":2.7475000000000003E-2},null,{"$f":"AF9","v":2.7475000000000003E-2}]
[null,null,null,null,null,null,null,null,null,null,null,null,null,null,null,null,null,null,null,null,null,null,null,null,null,null,null,null,null,"Metals",{"$f":"Weights!I57","v":0.78500000000000003},{"$f":"K$9*AE10","v":2.7475000000000003E-2},null,{"$f":"AF10","v":2.7475000000000003E-2}]
{"$rows_left_out":151}
{"sheet":"Weights","index":5,"n_rows":250,"n_cols":17,"rows_kept":250,"cut":false,"hidden":true,"merged":[[17,2,18,3],[17,4,18,11],[19,2,23,3],[19,4,23,6],[19,7,23,11],[14,2,14,3],[14,4,14,6],[14,7,14,11],[15,2,16,3],[15,4,16,6],[15,7,16,11],[11,2,11,3],[11,4,11,6],[11,7,11,11],[12,2,13,3],[12,4,13,6],[12,7,13,11],[8,2,8,3],[8,4,8,6],[8,7,8,11],[9,2,10,3],[9,4,10,6],[9,7,10,11],[5,2,5,3],[5,4,5,6],[5,7,5,11],[6,2,7,3],[6,4,7,6],[6,7,7,11],[1,2,2,3],[1,4,2,6],[1,7,2,11],[3,2,4,3],[3,4,4,6],[3,7,4,11]]}
[]
[null,null,"Intensity of Importance on a absolute scale",null,"Definition",null,null,"Explanation"]
[]
[null,null,1,null,"Equal importance",null,null,"Two activities contribute equally to the objective"]
[]
[null,null,2,null,"Weak or slight"]
[null,null,3,null,"Moderate importance of one over another",null,null,"Experience and judgment strongly favor one activity over another"]
[]
[null,null,4,null,"Moderate plus"]
[null,null,5,null,"Strong importance",null,null,"Experience and judgement strongly favor one activity over another"]
{"$rows_left_out":240}